This repository has been archived by the owner on Jun 20, 2019. It is now read-only.
-
Notifications
You must be signed in to change notification settings - Fork 2
/
Copy patheverest-build-0e677940-23475.err
817 lines (810 loc) · 93.2 KB
/
everest-build-0e677940-23475.err
1
2
3
4
5
6
7
8
9
10
11
12
13
14
15
16
17
18
19
20
21
22
23
24
25
26
27
28
29
30
31
32
33
34
35
36
37
38
39
40
41
42
43
44
45
46
47
48
49
50
51
52
53
54
55
56
57
58
59
60
61
62
63
64
65
66
67
68
69
70
71
72
73
74
75
76
77
78
79
80
81
82
83
84
85
86
87
88
89
90
91
92
93
94
95
96
97
98
99
100
101
102
103
104
105
106
107
108
109
110
111
112
113
114
115
116
117
118
119
120
121
122
123
124
125
126
127
128
129
130
131
132
133
134
135
136
137
138
139
140
141
142
143
144
145
146
147
148
149
150
151
152
153
154
155
156
157
158
159
160
161
162
163
164
165
166
167
168
169
170
171
172
173
174
175
176
177
178
179
180
181
182
183
184
185
186
187
188
189
190
191
192
193
194
195
196
197
198
199
200
201
202
203
204
205
206
207
208
209
210
211
212
213
214
215
216
217
218
219
220
221
222
223
224
225
226
227
228
229
230
231
232
233
234
235
236
237
238
239
240
241
242
243
244
245
246
247
248
249
250
251
252
253
254
255
256
257
258
259
260
261
262
263
264
265
266
267
268
269
270
271
272
273
274
275
276
277
278
279
280
281
282
283
284
285
286
287
288
289
290
291
292
293
294
295
296
297
298
299
300
301
302
303
304
305
306
307
308
309
310
311
312
313
314
315
316
317
318
319
320
321
322
323
324
325
326
327
328
329
330
331
332
333
334
335
336
337
338
339
340
341
342
343
344
345
346
347
348
349
350
351
352
353
354
355
356
357
358
359
360
361
362
363
364
365
366
367
368
369
370
371
372
373
374
375
376
377
378
379
380
381
382
383
384
385
386
387
388
389
390
391
392
393
394
395
396
397
398
399
400
401
402
403
404
405
406
407
408
409
410
411
412
413
414
415
416
417
418
419
420
421
422
423
424
425
426
427
428
429
430
431
432
433
434
435
436
437
438
439
440
441
442
443
444
445
446
447
448
449
450
451
452
453
454
455
456
457
458
459
460
461
462
463
464
465
466
467
468
469
470
471
472
473
474
475
476
477
478
479
480
481
482
483
484
485
486
487
488
489
490
491
492
493
494
495
496
497
498
499
500
501
502
503
504
505
506
507
508
509
510
511
512
513
514
515
516
517
518
519
520
521
522
523
524
525
526
527
528
529
530
531
532
533
534
535
536
537
538
539
540
541
542
543
544
545
546
547
548
549
550
551
552
553
554
555
556
557
558
559
560
561
562
563
564
565
566
567
568
569
570
571
572
573
574
575
576
577
578
579
580
581
582
583
584
585
586
587
588
589
590
591
592
593
594
595
596
597
598
599
600
601
602
603
604
605
606
607
608
609
610
611
612
613
614
615
616
617
618
619
620
621
622
623
624
625
626
627
628
629
630
631
632
633
634
635
636
637
638
639
640
641
642
643
644
645
646
Cloning into 'fstarlang_binaries'...
Already on 'master'
Cloning into 'mitls-fstar'...
Already on 'master'
Cloning into 'vale'...
Already on 'master'
Cloning into 'FStar'...
Checking out files: 25% (762/3015) Checking out files: 26% (784/3015) Checking out files: 27% (815/3015) Checking out files: 28% (845/3015) Checking out files: 29% (875/3015) Checking out files: 30% (905/3015) Checking out files: 31% (935/3015) Checking out files: 32% (965/3015) Checking out files: 33% (995/3015) Checking out files: 34% (1026/3015) Checking out files: 35% (1056/3015) Checking out files: 36% (1086/3015) Checking out files: 37% (1116/3015) Checking out files: 38% (1146/3015) Checking out files: 39% (1176/3015) Checking out files: 40% (1206/3015) Checking out files: 41% (1237/3015) Checking out files: 42% (1267/3015) Checking out files: 43% (1297/3015) Checking out files: 44% (1327/3015) Checking out files: 45% (1357/3015) Checking out files: 46% (1387/3015) Checking out files: 47% (1418/3015) Checking out files: 48% (1448/3015) Checking out files: 49% (1478/3015) Checking out files: 49% (1491/3015) Checking out files: 50% (1508/3015) Checking out files: 51% (1538/3015) Checking out files: 52% (1568/3015) Checking out files: 53% (1598/3015) Checking out files: 54% (1629/3015) Checking out files: 55% (1659/3015) Checking out files: 56% (1689/3015) Checking out files: 57% (1719/3015) Checking out files: 58% (1749/3015) Checking out files: 59% (1779/3015) Checking out files: 60% (1809/3015) Checking out files: 61% (1840/3015) Checking out files: 62% (1870/3015) Checking out files: 63% (1900/3015) Checking out files: 64% (1930/3015) Checking out files: 65% (1960/3015) Checking out files: 66% (1990/3015) Checking out files: 67% (2021/3015) Checking out files: 68% (2051/3015) Checking out files: 69% (2081/3015) Checking out files: 70% (2111/3015) Checking out files: 71% (2141/3015) Checking out files: 72% (2171/3015) Checking out files: 72% (2187/3015) Checking out files: 73% (2201/3015) Checking out files: 74% (2232/3015) Checking out files: 75% (2262/3015) Checking out files: 76% (2292/3015) Checking out files: 77% (2322/3015) Checking out files: 78% (2352/3015) Checking out files: 79% (2382/3015) Checking out files: 80% (2412/3015) Checking out files: 81% (2443/3015) Checking out files: 82% (2473/3015) Checking out files: 83% (2503/3015) Checking out files: 84% (2533/3015) Checking out files: 85% (2563/3015) Checking out files: 86% (2593/3015) Checking out files: 87% (2624/3015) Checking out files: 88% (2654/3015) Checking out files: 89% (2684/3015) Checking out files: 90% (2714/3015) Checking out files: 91% (2744/3015) Checking out files: 92% (2774/3015) Checking out files: 93% (2804/3015) Checking out files: 94% (2835/3015) Checking out files: 95% (2865/3015) Checking out files: 95% (2880/3015) Checking out files: 96% (2895/3015) Checking out files: 97% (2925/3015) Checking out files: 98% (2955/3015) Checking out files: 99% (2985/3015) Checking out files: 100% (3015/3015) Checking out files: 100% (3015/3015), done.
Switched to a new branch 'c_popl'
Cloning into 'hacl-star'...
Checking out files: 14% (748/5290) Checking out files: 15% (794/5290) Checking out files: 16% (847/5290) Checking out files: 17% (900/5290) Checking out files: 18% (953/5290) Checking out files: 19% (1006/5290) Checking out files: 20% (1058/5290) Checking out files: 21% (1111/5290) Checking out files: 22% (1164/5290) Checking out files: 23% (1217/5290) Checking out files: 24% (1270/5290) Checking out files: 25% (1323/5290) Checking out files: 26% (1376/5290) Checking out files: 27% (1429/5290) Checking out files: 28% (1482/5290) Checking out files: 29% (1535/5290) Checking out files: 29% (1574/5290) Checking out files: 30% (1587/5290) Checking out files: 31% (1640/5290) Checking out files: 32% (1693/5290) Checking out files: 33% (1746/5290) Checking out files: 34% (1799/5290) Checking out files: 35% (1852/5290) Checking out files: 36% (1905/5290) Checking out files: 37% (1958/5290) Checking out files: 38% (2011/5290) Checking out files: 39% (2064/5290) Checking out files: 40% (2116/5290) Checking out files: 41% (2169/5290) Checking out files: 42% (2222/5290) Checking out files: 43% (2275/5290) Checking out files: 43% (2325/5290) Checking out files: 44% (2328/5290) Checking out files: 45% (2381/5290) Checking out files: 46% (2434/5290) Checking out files: 47% (2487/5290) Checking out files: 48% (2540/5290) Checking out files: 49% (2593/5290) Checking out files: 50% (2645/5290) Checking out files: 51% (2698/5290) Checking out files: 52% (2751/5290) Checking out files: 53% (2804/5290) Checking out files: 54% (2857/5290) Checking out files: 55% (2910/5290) Checking out files: 56% (2963/5290) Checking out files: 57% (3016/5290) Checking out files: 58% (3069/5290) Checking out files: 59% (3122/5290) Checking out files: 59% (3143/5290) Checking out files: 60% (3174/5290) Checking out files: 61% (3227/5290) Checking out files: 62% (3280/5290) Checking out files: 63% (3333/5290) Checking out files: 64% (3386/5290) Checking out files: 65% (3439/5290) Checking out files: 66% (3492/5290) Checking out files: 67% (3545/5290) Checking out files: 68% (3598/5290) Checking out files: 69% (3651/5290) Checking out files: 70% (3703/5290) Checking out files: 71% (3756/5290) Checking out files: 72% (3809/5290) Checking out files: 73% (3862/5290) Checking out files: 73% (3878/5290) Checking out files: 74% (3915/5290) Checking out files: 75% (3968/5290) Checking out files: 76% (4021/5290) Checking out files: 77% (4074/5290) Checking out files: 78% (4127/5290) Checking out files: 79% (4180/5290) Checking out files: 80% (4232/5290) Checking out files: 81% (4285/5290) Checking out files: 82% (4338/5290) Checking out files: 83% (4391/5290) Checking out files: 84% (4444/5290) Checking out files: 85% (4497/5290) Checking out files: 86% (4550/5290) Checking out files: 87% (4603/5290) Checking out files: 87% (4613/5290) Checking out files: 88% (4656/5290) Checking out files: 89% (4709/5290) Checking out files: 90% (4761/5290) Checking out files: 91% (4814/5290) Checking out files: 92% (4867/5290) Checking out files: 93% (4920/5290) Checking out files: 94% (4973/5290) Checking out files: 95% (5026/5290) Checking out files: 96% (5079/5290) Checking out files: 97% (5132/5290) Checking out files: 98% (5185/5290) Checking out files: 99% (5238/5290) Checking out files: 100% (5290/5290) Checking out files: 100% (5290/5290), done.
Submodule 'other_providers/libsodium' (https://github.com/jedisct1/libsodium.git) registered for path 'other_providers/libsodium'
Submodule 'other_providers/openssl' (https://github.com/openssl/openssl.git) registered for path 'other_providers/openssl'
Submodule 'other_providers/vale' (https://github.com/project-everest/vale.git) registered for path 'other_providers/vale'
Cloning into '/cygdrive/c/build/agent2/_work/6/s/hacl-star/other_providers/libsodium'...
Cloning into '/cygdrive/c/build/agent2/_work/6/s/hacl-star/other_providers/openssl'...
Cloning into '/cygdrive/c/build/agent2/_work/6/s/hacl-star/other_providers/vale'...
Submodule 'boringssl' (https://boringssl.googlesource.com/boringssl) registered for path 'other_providers/openssl/boringssl'
Submodule 'krb5' (https://github.com/krb5/krb5) registered for path 'other_providers/openssl/krb5'
Submodule 'pyca.cryptography' (https://github.com/pyca/cryptography.git) registered for path 'other_providers/openssl/pyca-cryptography'
Cloning into '/cygdrive/c/build/agent2/_work/6/s/hacl-star/other_providers/openssl/boringssl'...
Cloning into '/cygdrive/c/build/agent2/_work/6/s/hacl-star/other_providers/openssl/krb5'...
Cloning into '/cygdrive/c/build/agent2/_work/6/s/hacl-star/other_providers/openssl/pyca-cryptography'...
Already on 'master'
warning: unable to rmdir krb5: Directory not empty
Cloning into 'kremlin'...
Already on 'master'
Warning: you are using the standard library and/or the %inline keyword. We
recommend switching on --infer in order to avoid obscure type error messages.
File "CoreCrypto.ml", line 524, characters 24-144:
Warning 8: this pattern-matching is not exhaustive.
Here is an example of a case that is not matched:
ECC_X448
/bin/sh: line 0: cd: openssl: No such file or directory
make: *** [Makefile:77: openssl/libcrypto.a] Error 1
make: Target 'all' not remade because of errors.
+ run_nuget
+ nuget restore vale/tools/Vale/src/packages.config -PackagesDirectory vale/tools/FsLexYacc
+ run_scons --NOVERIFY
+ cmd=--NOVERIFY
+ is_windows
+ [[ Windows_NT == \W\i\n\d\o\w\s\_\N\T ]]
+++ pwd
++ cygpath -w /cygdrive/c/build/agent2/_work/6/s/vale
+ DIR='C:\build\agent2\_work\6\s\vale'
+ THIS_PID=18680
+ SCONS_EXECS=0
+ SCONS_INVOKE_FILE=everest18680scons0.bat
+ [[ -e everest18680scons0.bat ]]
+ cat
+ chmod +x everest18680scons0.bat
+ ./everest18680scons0.bat
warning FS0082: There was a mismatch between the processor architecture of the project being built "MSIL" and the processor architecture of the reference "mscorlib.dll", "x86". This mismatch may cause runtime failures. Please consider changing the targeted processor architecture of your project through the Configuration Manager so as to align the processor architectures between your project and references, or take a dependency on references with a processor architecture that matches the targeted processor architecture of your project. (Code=MSB3270)
warning FS0082: There was a mismatch between the processor architecture of the project being built "MSIL" and the processor architecture of the reference "System.Data.dll", "x86". This mismatch may cause runtime failures. Please consider changing the targeted processor architecture of your project through the Configuration Manager so as to align the processor architectures between your project and references, or take a dependency on references with a processor architecture that matches the targeted processor architecture of your project. (Code=MSB3270)
warning FS0082: There was a mismatch between the processor architecture of the project being built "MSIL" and the processor architecture of the reference "System.Web.dll", "x86". This mismatch may cause runtime failures. Please consider changing the targeted processor architecture of your project through the Configuration Manager so as to align the processor architectures between your project and references, or take a dependency on references with a processor architecture that matches the targeted processor architecture of your project. (Code=MSB3270)
warning FS0082: There was a mismatch between the processor architecture of the project being built "MSIL" and the processor architecture of the reference "mscorlib.dll", "x86". This mismatch may cause runtime failures. Please consider changing the targeted processor architecture of your project through the Configuration Manager so as to align the processor architectures between your project and references, or take a dependency on references with a processor architecture that matches the targeted processor architecture of your project. (Code=MSB3270)
warning FS0082: There was a mismatch between the processor architecture of the project being built "MSIL" and the processor architecture of the reference "System.Data.dll", "x86". This mismatch may cause runtime failures. Please consider changing the targeted processor architecture of your project through the Configuration Manager so as to align the processor architectures between your project and references, or take a dependency on references with a processor architecture that matches the targeted processor architecture of your project. (Code=MSB3270)
warning FS0082: There was a mismatch between the processor architecture of the project being built "MSIL" and the processor architecture of the reference "System.Web.dll", "x86". This mismatch may cause runtime failures. Please consider changing the targeted processor architecture of your project through the Configuration Manager so as to align the processor architectures between your project and references, or take a dependency on references with a processor architecture that matches the targeted processor architecture of your project. (Code=MSB3270)
warning FS2009: Ignoring mixed managed/unmanaged assembly 'System.Data' during static linking
+ SCONS_RETCODE=0
+ rm -f everest18680scons0.bat
+ return 0
+ cd hacl-star
+ make -C secure_api/vale/asm import
+ git diff --exit-code secure_api/vale/asm
+ magenta 'New assemblies from Vale, diff is above'
+ color 'New assemblies from Vale, diff is above' 5
+ '[' -t 1 ']'
+ echo New assemblies from Vale, diff is above
Spec.Poly1305.fst(35,29-35,29): (Error 168) Syntax error: Parsing.Parse_error
1 error was reported (see above)
make[2]: *** [Makefile:59: poly1305.exe] Error 1
Warning 3: run_or_warn: the following command failed:
C:/build/agent2/_work/6/s/FStar/bin/fstar.exe --odir ccomp-c --codegen Kremlin --lax C:/build/agent2/_work/6/s/FStar/ulib/FStar.UInt128.fst --no_extract FStar.Monotonic.HyperStack --no_extract FStar.Buffer --no_extract FStar.Monotonic.HyperHeap --no_extract FStar.Map --no_extract FStar.Math.Lib --no_extract FStar.HyperHeap --no_extract FStar.HyperStack --no_extract FStar.HyperStack.ST --no_extract FStar.Seq.Base --no_extract FStar.Int128 --no_extract FStar.UInt64 --no_extract FStar.Int64 --no_extract FStar.UInt63 --no_extract FStar.Int63 --no_extract FStar.UInt32 --no_extract FStar.Int32 --no_extract FStar.UInt31 --no_extract FStar.Int31 --no_extract FStar.UInt16 --no_extract FStar.Int16 --no_extract FStar.UInt8 --no_extract FStar.Int8 --trace_error --include C:/build/agent2/_work/6/s/kremlin/kremlib C:/build/agent2/_work/6/s/FStar/ulib/FStar.UInt128.fst C:/build/agent2/_work/6/s/FStar/ulib/FStar.Int.Cast.Full.fst Hacl.UInt128.fst Hacl.Cast.fst
F* failed
Fatal error: exception Warnings.Fatal("Unrecoverable error")
Raised at file "src/Warnings.ml", line 49, characters 4-39
Called from file "src/Driver.ml", line 287, characters 6-29
Called from file "src/Kremlin.ml", line 326, characters 14-96
make[5]: *** [Makefile:38: ccomp-c/FStar.h] Error 2
Warning 3: run_or_warn: the following command failed:
C:/build/agent2/_work/6/s/FStar/bin/fstar.exe --odir chacha-c --codegen Kremlin --lax --no_extract FStar.Monotonic.HyperStack --no_extract FStar.Buffer --no_extract FStar.Monotonic.HyperHeap --no_extract FStar.Map --no_extract FStar.Math.Lib --no_extract FStar.HyperHeap --no_extract FStar.HyperStack --no_extract FStar.HyperStack.ST --no_extract FStar.Seq.Base --no_extract FStar.Int128 --no_extract FStar.UInt64 --no_extract FStar.Int64 --no_extract FStar.UInt63 --no_extract FStar.Int63 --no_extract FStar.UInt32 --no_extract FStar.Int32 --no_extract FStar.UInt31 --no_extract FStar.Int31 --no_extract FStar.UInt16 --no_extract FStar.Int16 --no_extract FStar.UInt8 --no_extract FStar.Int8 --trace_error --include C:/build/agent2/_work/6/s/hacl-star/code/lib/kremlin --include C:/build/agent2/_work/6/s/kremlin/kremlib --include C:/build/agent2/_work/6/s/hacl-star/specs --include . --include C:/build/agent2/_work/6/s/kremlin/kremlib Hacl.Lib.LoadStore32.fst Hacl.Lib.Create.fst Hacl.Impl.Xor.Lemmas.fst Hacl.Impl.Chacha20.fst Hacl.Chacha20.fst Hacl.Test.Chacha20.fst
F* failed
Fatal error: exception Warnings.Fatal("Unrecoverable error")
Raised at file "src/Warnings.ml", line 49, characters 4-39
Called from file "src/Driver.ml", line 287, characters 6-29
Called from file "src/Kremlin.ml", line 326, characters 14-96
make[5]: *** [Makefile:48: chacha-c/out.krml] Error 2
Warning 3: run_or_warn: the following command failed:
C:/build/agent2/_work/6/s/FStar/bin/fstar.exe --odir salsa-c --codegen Kremlin --lax --no_extract FStar.Monotonic.HyperStack --no_extract FStar.Buffer --no_extract FStar.Monotonic.HyperHeap --no_extract FStar.Map --no_extract FStar.Math.Lib --no_extract FStar.HyperHeap --no_extract FStar.HyperStack --no_extract FStar.HyperStack.ST --no_extract FStar.Seq.Base --no_extract FStar.Int128 --no_extract FStar.UInt64 --no_extract FStar.Int64 --no_extract FStar.UInt63 --no_extract FStar.Int63 --no_extract FStar.UInt32 --no_extract FStar.Int32 --no_extract FStar.UInt31 --no_extract FStar.Int31 --no_extract FStar.UInt16 --no_extract FStar.Int16 --no_extract FStar.UInt8 --no_extract FStar.Int8 --trace_error --include C:/build/agent2/_work/6/s/hacl-star/code/lib/kremlin --include C:/build/agent2/_work/6/s/kremlin/kremlib --include C:/build/agent2/_work/6/s/hacl-star/specs --include . --include C:/build/agent2/_work/6/s/kremlin/kremlib Hacl.Impl.Salsa20.fst Hacl.Salsa20.fst Hacl.Test.Salsa20.fst
F* failed
Fatal error: exception Warnings.Fatal("Unrecoverable error")
Raised at file "src/Warnings.ml", line 49, characters 4-39
Called from file "src/Driver.ml", line 287, characters 6-29
Called from file "src/Kremlin.ml", line 326, characters 14-96
make[5]: *** [Makefile:66: salsa-c/out.krml] Error 2
Spec.Poly1305.fst(35,29-35,29): (Error 168) Syntax error: Parsing.Parse_error
1 error was reported (see above)
make[2]: *** [Makefile:91: chacha20poly1305.exe] Error 1
Warning 3: run_or_warn: the following command failed:
C:/build/agent2/_work/6/s/FStar/bin/fstar.exe --odir poly-c --codegen Kremlin --lax --no_extract FStar.Monotonic.HyperStack --no_extract FStar.Buffer --no_extract FStar.Monotonic.HyperHeap --no_extract FStar.Map --no_extract FStar.Math.Lib --no_extract FStar.HyperHeap --no_extract FStar.HyperStack --no_extract FStar.HyperStack.ST --no_extract FStar.Seq.Base --no_extract FStar.Int128 --no_extract FStar.UInt64 --no_extract FStar.Int64 --no_extract FStar.UInt63 --no_extract FStar.Int63 --no_extract FStar.UInt32 --no_extract FStar.Int32 --no_extract FStar.UInt31 --no_extract FStar.Int31 --no_extract FStar.UInt16 --no_extract FStar.Int16 --no_extract FStar.UInt8 --no_extract FStar.Int8 --trace_error --include C:/build/agent2/_work/6/s/hacl-star/code/lib/kremlin --include C:/build/agent2/_work/6/s/kremlin/kremlib --include C:/build/agent2/_work/6/s/hacl-star/specs --include . --include ../bignum --include C:/build/agent2/_work/6/s/kremlin/kremlib ../bignum/Hacl.Spec.Bignum.Field.fst ../bignum/Hacl.Bignum.Limb.fst ../bignum/Hacl.Bignum.Wide.fst ../bignum/Hacl.Spec.Bignum.Bigint.fst ../bignum/Hacl.Spec.Bignum.Fsum.fst ../bignum/Hacl.Spec.Bignum.Fproduct.fst ../bignum/Hacl.Spec.Bignum.Fmul.fst ../bignum/Hacl.Bignum.Fsum.fst ../bignum/Hacl.Bignum.Fproduct.fst ../bignum/Hacl.Bignum.Fmul.fst Hacl.Bignum.Constants.fst Hacl.Bignum.Parameters.fst Hacl.Spec.Bignum.Modulo.fst Hacl.Spec.Bignum.AddAndMultiply.fst ../../specs/Spec.Poly1305.fst Hacl.Spec.Poly1305_64.fst Hacl.Spe.Poly1305_64.fst Hacl.Bignum.Modulo.fst Hacl.Bignum.AddAndMultiply.fst Hacl.Impl.Poly1305_64.fst Hacl.Standalone.Poly1305_64.fst Hacl.Poly1305_64.fst Hacl.Spec.Poly1305_64.Lemmas1.fst AEAD.Poly1305_64.fst Hacl.Test.Poly1305_64.fst
F* failed
Fatal error: exception Warnings.Fatal("Unrecoverable error")
Raised at file "src/Warnings.ml", line 49, characters 4-39
Called from file "src/Driver.ml", line 287, characters 6-29
Called from file "src/Kremlin.ml", line 326, characters 14-96
make[5]: *** [Makefile:82: poly-c/out.krml] Error 2
make[5]: Target 'extract-c' not remade because of errors.
make[4]: *** [Makefile:9: poly1305-c] Error 2
Warning 3: run_or_warn: the following command failed:
C:/build/agent2/_work/6/s/FStar/bin/fstar.exe --odir poly-c --codegen Kremlin --lax --no_extract FStar.Monotonic.HyperStack --no_extract FStar.Buffer --no_extract FStar.Monotonic.HyperHeap --no_extract FStar.Map --no_extract FStar.Math.Lib --no_extract FStar.HyperHeap --no_extract FStar.HyperStack --no_extract FStar.HyperStack.ST --no_extract FStar.Seq.Base --no_extract FStar.Int128 --no_extract FStar.UInt64 --no_extract FStar.Int64 --no_extract FStar.UInt63 --no_extract FStar.Int63 --no_extract FStar.UInt32 --no_extract FStar.Int32 --no_extract FStar.UInt31 --no_extract FStar.Int31 --no_extract FStar.UInt16 --no_extract FStar.Int16 --no_extract FStar.UInt8 --no_extract FStar.Int8 --trace_error --include C:/build/agent2/_work/6/s/hacl-star/code/lib/kremlin --include C:/build/agent2/_work/6/s/kremlin/kremlib --include C:/build/agent2/_work/6/s/hacl-star/specs --include . --include ../bignum --include C:/build/agent2/_work/6/s/kremlin/kremlib C:/build/agent2/_work/6/s/hacl-star/code/bignum/Hacl.Spec.Bignum.Field.fst C:/build/agent2/_work/6/s/hacl-star/code/bignum/Hacl.Bignum.Limb.fst C:/build/agent2/_work/6/s/hacl-star/code/bignum/Hacl.Bignum.Wide.fst C:/build/agent2/_work/6/s/hacl-star/code/bignum/Hacl.Spec.Bignum.Bigint.fst C:/build/agent2/_work/6/s/hacl-star/code/bignum/Hacl.Spec.Bignum.Fsum.fst C:/build/agent2/_work/6/s/hacl-star/code/bignum/Hacl.Spec.Bignum.Fproduct.fst C:/build/agent2/_work/6/s/hacl-star/code/bignum/Hacl.Spec.Bignum.Fmul.fst C:/build/agent2/_work/6/s/hacl-star/code/bignum/Hacl.Bignum.Fsum.fst C:/build/agent2/_work/6/s/hacl-star/code/bignum/Hacl.Bignum.Fproduct.fst C:/build/agent2/_work/6/s/hacl-star/code/bignum/Hacl.Bignum.Fmul.fst Hacl.Bignum.Constants.fst Hacl.Bignum.Parameters.fst Hacl.Spec.Bignum.Modulo.fst Hacl.Spec.Bignum.AddAndMultiply.fst Hacl.Spec.Poly1305_32.State.fst Hacl.Spec.Poly1305_32.Lemmas.fst Hacl.Spec.Poly1305_32.fst Hacl.Spe.Poly1305_32.fst Hacl.Bignum.Modulo.fst Hacl.Bignum.AddAndMultiply.fst Hacl.Impl.Poly1305_32.State.fst Hacl.Impl.Poly1305_32.fst Hacl.Standalone.Poly1305_32.fst Hacl.Poly1305_32.fst Hacl.Test.Poly1305_32.fst
F* failed
Fatal error: exception Warnings.Fatal("Unrecoverable error")
Raised at file "src/Warnings.ml", line 49, characters 4-39
Called from file "src/Driver.ml", line 287, characters 6-29
Called from file "src/Kremlin.ml", line 326, characters 14-96
make[5]: *** [Makefile:75: poly-c/out.krml] Error 2
make[5]: Target 'extract-c' not remade because of errors.
make[4]: *** [Makefile:9: poly1305_32-c] Error 2
Warning 3: run_or_warn: the following command failed:
C:/build/agent2/_work/6/s/FStar/bin/fstar.exe --odir chacha-vec128-c --codegen Kremlin --lax --no_extract FStar.Monotonic.HyperStack --no_extract FStar.Buffer --no_extract FStar.Monotonic.HyperHeap --no_extract FStar.Map --no_extract FStar.Math.Lib --no_extract FStar.HyperHeap --no_extract FStar.HyperStack --no_extract FStar.HyperStack.ST --no_extract FStar.Seq.Base --no_extract FStar.Int128 --no_extract FStar.UInt64 --no_extract FStar.Int64 --no_extract FStar.UInt63 --no_extract FStar.Int63 --no_extract FStar.UInt32 --no_extract FStar.Int32 --no_extract FStar.UInt31 --no_extract FStar.Int31 --no_extract FStar.UInt16 --no_extract FStar.Int16 --no_extract FStar.UInt8 --no_extract FStar.Int8 --trace_error --include C:/build/agent2/_work/6/s/hacl-star/code/lib/kremlin --include C:/build/agent2/_work/6/s/kremlin/kremlib --include C:/build/agent2/_work/6/s/hacl-star/specs --include . --include C:/build/agent2/_work/6/s/kremlin/kremlib Hacl.Impl.Chacha20.Vec128.State.fst Hacl.Impl.Chacha20.Vec128.fst Hacl.Chacha20.Vec128.fst Hacl.Test.Chacha20.Vec128.fst
F* failed
Fatal error: exception Warnings.Fatal("Unrecoverable error")
Raised at file "src/Warnings.ml", line 49, characters 4-39
Called from file "src/Driver.ml", line 287, characters 6-29
Called from file "src/Kremlin.ml", line 326, characters 14-96
make[5]: *** [Makefile:83: chacha-vec128-c/out.krml] Error 2
make[5]: Target 'extract-c' not remade because of errors.
make[4]: *** [Makefile:9: salsa-family-c] Error 2
Warning 3: run_or_warn: the following command failed:
C:/build/agent2/_work/6/s/FStar/bin/fstar.exe --odir aead-c --codegen Kremlin --lax --no_extract FStar.Monotonic.HyperStack --no_extract FStar.Buffer --no_extract FStar.Monotonic.HyperHeap --no_extract FStar.Map --no_extract FStar.Math.Lib --no_extract FStar.HyperHeap --no_extract FStar.HyperStack --no_extract FStar.HyperStack.ST --no_extract FStar.Seq.Base --no_extract FStar.Int128 --no_extract FStar.UInt64 --no_extract FStar.Int64 --no_extract FStar.UInt63 --no_extract FStar.Int63 --no_extract FStar.UInt32 --no_extract FStar.Int32 --no_extract FStar.UInt31 --no_extract FStar.Int31 --no_extract FStar.UInt16 --no_extract FStar.Int16 --no_extract FStar.UInt8 --no_extract FStar.Int8 --trace_error --include C:/build/agent2/_work/6/s/hacl-star/code/lib/kremlin --include C:/build/agent2/_work/6/s/kremlin/kremlib --include C:/build/agent2/_work/6/s/hacl-star/specs --include . --include ../salsa-family --include C:/build/agent2/_work/6/s/hacl-star/code/bignum --include ../curve25519 --include ../poly1305 --include ../hash --include C:/build/agent2/_work/6/s/kremlin/kremlib Hacl.Chacha20Poly1305.fst
F* failed
Fatal error: exception Warnings.Fatal("Unrecoverable error")
Raised at file "src/Warnings.ml", line 49, characters 4-39
Called from file "src/Driver.ml", line 287, characters 6-29
Called from file "src/Kremlin.ml", line 326, characters 14-96
make[5]: *** [Makefile:49: aead-c/Hacl_Chacha20Poly1305.c] Error 2
Warning 3: run_or_warn: the following command failed:
C:/build/agent2/_work/6/s/FStar/bin/fstar.exe --odir sha2-c --codegen Kremlin --lax --no_extract FStar.Monotonic.HyperStack --no_extract FStar.Buffer --no_extract FStar.Monotonic.HyperHeap --no_extract FStar.Map --no_extract FStar.Math.Lib --no_extract FStar.HyperHeap --no_extract FStar.HyperStack --no_extract FStar.HyperStack.ST --no_extract FStar.Seq.Base --no_extract FStar.Int128 --no_extract FStar.UInt64 --no_extract FStar.Int64 --no_extract FStar.UInt63 --no_extract FStar.Int63 --no_extract FStar.UInt32 --no_extract FStar.Int32 --no_extract FStar.UInt31 --no_extract FStar.Int31 --no_extract FStar.UInt16 --no_extract FStar.Int16 --no_extract FStar.UInt8 --no_extract FStar.Int8 --trace_error --include C:/build/agent2/_work/6/s/hacl-star/code/lib/kremlin --include C:/build/agent2/_work/6/s/kremlin/kremlib --include C:/build/agent2/_work/6/s/hacl-star/specs --include . --include C:/build/agent2/_work/6/s/kremlin/kremlib Hacl.Hash.Lib.LoadStore.fst Hacl.Hash.Lib.Create.fst Hacl.Impl.SHA2_512.Lemmas.fst Hacl.Impl.SHA2_512.fst Hacl.Impl.SHA2_384.Lemmas.fst Hacl.Impl.SHA2_384.fst Hacl.Impl.SHA2_256.Lemmas.fst Hacl.Impl.SHA2_256.fst Hacl.SHA2_256.fst Hacl.SHA2_384.fst Hacl.SHA2_512.fst Hacl.Test.SHA2_256.fst Hacl.Test.SHA2_384.fst Hacl.Test.SHA2_512.fst
F* failed
Fatal error: exception Warnings.Fatal("Unrecoverable error")
Raised at file "src/Warnings.ml", line 49, characters 4-39
Called from file "src/Driver.ml", line 287, characters 6-29
Called from file "src/Kremlin.ml", line 326, characters 14-96
make[5]: *** [Makefile:43: sha2-c/out.krml] Error 2
make[5]: Target 'extract-c' not remade because of errors.
make[4]: *** [Makefile:9: hash-c] Error 2
(Error 117) You may have a cyclic dependence on module spec.sha512: use --dep full to confirm. Alternatively, invoking fstar with Spec.SHA512.fst on the command line breaks the abstraction imposed by its interface Spec.SHA512.fsti; if you really want this behavior add the option '--expose_interfaces'
1 error was reported (see above)
make[2]: *** [Makefile:163: ed25519.exe] Error 1
Warning 3: run_or_warn: the following command failed:
C:/build/agent2/_work/6/s/FStar/bin/fstar.exe --odir ed25519-c --codegen Kremlin --lax --no_extract FStar.Monotonic.HyperStack --no_extract FStar.Buffer --no_extract FStar.Monotonic.HyperHeap --no_extract FStar.Map --no_extract FStar.Math.Lib --no_extract FStar.HyperHeap --no_extract FStar.HyperStack --no_extract FStar.HyperStack.ST --no_extract FStar.Seq.Base --no_extract FStar.Int128 --no_extract FStar.UInt64 --no_extract FStar.Int64 --no_extract FStar.UInt63 --no_extract FStar.Int63 --no_extract FStar.UInt32 --no_extract FStar.Int32 --no_extract FStar.UInt31 --no_extract FStar.Int31 --no_extract FStar.UInt16 --no_extract FStar.Int16 --no_extract FStar.UInt8 --no_extract FStar.Int8 --trace_error --include C:/build/agent2/_work/6/s/hacl-star/code/lib/kremlin --include C:/build/agent2/_work/6/s/kremlin/kremlib --include C:/build/agent2/_work/6/s/hacl-star/specs --include . --include ../bignum --include ../curve25519 --include ../hash --include C:/build/agent2/_work/6/s/kremlin/kremlib Hacl.Bignum25519.fst ../hash/Hacl.Impl.SHA512.Ed25519.fst ../hash/Hacl.SHA2_512.fst Hacl.Impl.Load56.fst Hacl.Impl.Load51.fst Hacl.Impl.Store51.fst Hacl.Impl.BignumQ.Mul.fst Hacl.Impl.SHA512.ModQ.fst Hacl.Impl.Sha512.fst Hacl.Impl.Ed25519.Pow2_252m2.fst Hacl.Impl.Ed25519.PointAdd.fst Hacl.Impl.Ed25519.PointDouble.fst Hacl.Impl.Ed25519.SecretExpand.fst Hacl.Impl.Ed25519.PointCompress.fst Hacl.Impl.Ed25519.PointDecompress.fst Hacl.Impl.Ed25519.RecoverX.fst Hacl.Impl.Ed25519.Ladder.Step.fst Hacl.Impl.Ed25519.Ladder.fst Hacl.Impl.Ed25519.PointEqual.fst Hacl.Impl.Ed25519.SecretToPublic.fst Hacl.Ed25519.fst Hacl.Test.Ed25519.fst
F* failed
Fatal error: exception Warnings.Fatal("Unrecoverable error")
Raised at file "src/Warnings.ml", line 49, characters 4-39
Called from file "src/Driver.ml", line 287, characters 6-29
Called from file "src/Kremlin.ml", line 326, characters 14-96
make[5]: *** [Makefile:135: ed25519-c/out.krml] Error 2
make[5]: Target 'extract-c' not remade because of errors.
make[4]: *** [Makefile:9: ed25519-c] Error 2
Warning 3: run_or_warn: the following command failed:
C:/build/agent2/_work/6/s/FStar/bin/fstar.exe --odir box-c --codegen Kremlin --lax --no_extract FStar.Monotonic.HyperStack --no_extract FStar.Buffer --no_extract FStar.Monotonic.HyperHeap --no_extract FStar.Map --no_extract FStar.Math.Lib --no_extract FStar.HyperHeap --no_extract FStar.HyperStack --no_extract FStar.HyperStack.ST --no_extract FStar.Seq.Base --no_extract FStar.Int128 --no_extract FStar.UInt64 --no_extract FStar.Int64 --no_extract FStar.UInt63 --no_extract FStar.Int63 --no_extract FStar.UInt32 --no_extract FStar.Int32 --no_extract FStar.UInt31 --no_extract FStar.Int31 --no_extract FStar.UInt16 --no_extract FStar.Int16 --no_extract FStar.UInt8 --no_extract FStar.Int8 --trace_error --include C:/build/agent2/_work/6/s/hacl-star/code/lib/kremlin --include C:/build/agent2/_work/6/s/kremlin/kremlib --include C:/build/agent2/_work/6/s/hacl-star/specs --include . --include ../salsa-family --include C:/build/agent2/_work/6/s/hacl-star/code/bignum --include ../curve25519 --include ../poly1305 --include ../hash --include C:/build/agent2/_work/6/s/kremlin/kremlib NaCl.fst
F* failed
Fatal error: exception Warnings.Fatal("Unrecoverable error")
Raised at file "src/Warnings.ml", line 49, characters 4-39
Called from file "src/Driver.ml", line 287, characters 6-29
Called from file "src/Kremlin.ml", line 326, characters 14-96
make[5]: *** [Makefile:44: box-c/NaCl.c] Error 2
C:\build\agent2\_work\6\s\hacl-star\code\lib\kremlin\FStar.Endianness.fst(190,8-190,19): (Warning 288) FStar.Seq.Base.createEmpty is deprecated, use Seq.empty instead
C:\build\agent2\_work\6\s\hacl-star\code\lib\kremlin\FStar.Endianness.fst(309,16-309,27): (Warning 288) FStar.Seq.Base.createEmpty is deprecated, use Seq.empty instead
C:\build\agent2\_work\6\s\hacl-star\code\lib\kremlin\FStar.Endianness.fst(330,16-330,27): (Warning 288) FStar.Seq.Base.createEmpty is deprecated, use Seq.empty instead
C:\build\agent2\_work\6\s\hacl-star\code\lib\kremlin\FStar.Endianness.fst(354,8-354,19): (Warning 288) FStar.Seq.Base.createEmpty is deprecated, use Seq.empty instead
Spec.GaloisField.fst(25,0-25,33): (Error 66) Failed to resolve implicit argument of type 'Spec.GaloisField.field' in the type of op_Plus_At (e1: Spec.GaloisField.felem (*?u8*) _ -> e2: Spec.GaloisField.felem (*?u8*) _ ->
Prims.Tot (Spec.GaloisField.felem (*?u8*) _))
1 error was reported (see above)
make[2]: *** [Makefile:51: gf128.exe] Error 1
Warning 3: run_or_warn: the following command failed:
C:/build/agent2/_work/6/s/FStar/bin/fstar.exe --odir policies-c --codegen Kremlin --lax --no_extract FStar.Monotonic.HyperStack --no_extract FStar.Buffer --no_extract FStar.Monotonic.HyperHeap --no_extract FStar.Map --no_extract FStar.Math.Lib --no_extract FStar.HyperHeap --no_extract FStar.HyperStack --no_extract FStar.HyperStack.ST --no_extract FStar.Seq.Base --no_extract FStar.Int128 --no_extract FStar.UInt64 --no_extract FStar.Int64 --no_extract FStar.UInt63 --no_extract FStar.Int63 --no_extract FStar.UInt32 --no_extract FStar.Int32 --no_extract FStar.UInt31 --no_extract FStar.Int31 --no_extract FStar.UInt16 --no_extract FStar.Int16 --no_extract FStar.UInt8 --no_extract FStar.Int8 --trace_error --include C:/build/agent2/_work/6/s/hacl-star/code/lib/kremlin --include C:/build/agent2/_work/6/s/kremlin/kremlib --include C:/build/agent2/_work/6/s/hacl-star/specs --include . --include ../salsa-family --include C:/build/agent2/_work/6/s/hacl-star/code/bignum --include ../curve25519 --include ../poly1305 --include ../hash --include C:/build/agent2/_work/6/s/kremlin/kremlib C:/build/agent2/_work/6/s/hacl-star/code/lib/kremlin/Hacl.Policies.fst
F* failed
Fatal error: exception Warnings.Fatal("Unrecoverable error")
Raised at file "src/Warnings.ml", line 49, characters 4-39
Called from file "src/Driver.ml", line 287, characters 6-29
Called from file "src/Kremlin.ml", line 326, characters 14-96
make[5]: *** [Makefile:41: policies-c/Hacl_Policies.c] Error 2
make[5]: Target 'extract-c' not remade because of errors.
make[4]: *** [Makefile:9: api-c] Error 2
Warning 3: run_or_warn: the following command failed:
C:/build/agent2/_work/6/s/FStar/bin/fstar.exe --odir lib-c --codegen Kremlin --lax --no_extract FStar.Monotonic.HyperStack --no_extract FStar.Buffer --no_extract FStar.Monotonic.HyperHeap --no_extract FStar.Map --no_extract FStar.Math.Lib --no_extract FStar.HyperHeap --no_extract FStar.HyperStack --no_extract FStar.HyperStack.ST --no_extract FStar.Seq.Base --no_extract FStar.Int128 --no_extract FStar.UInt64 --no_extract FStar.Int64 --no_extract FStar.UInt63 --no_extract FStar.Int63 --no_extract FStar.UInt32 --no_extract FStar.Int32 --no_extract FStar.UInt31 --no_extract FStar.Int31 --no_extract FStar.UInt16 --no_extract FStar.Int16 --no_extract FStar.UInt8 --no_extract FStar.Int8 --trace_error --include C:/build/agent2/_work/6/s/kremlin/kremlib Hacl.Policies.fst
F* failed
Fatal error: exception Warnings.Fatal("Unrecoverable error")
Raised at file "src/Warnings.ml", line 49, characters 4-39
Called from file "src/Driver.ml", line 287, characters 6-29
Called from file "src/Kremlin.ml", line 326, characters 14-96
make[5]: *** [Makefile:32: lib-c/Hacl_Policies.c] Error 2
make[5]: Target 'extract-c' not remade because of errors.
make[4]: *** [Makefile:9: lib/kremlin-c] Error 2
C:\build\agent2\_work\6\s\hacl-star\code\lib\kremlin\FStar.Endianness.fst(190,8-190,19): (Warning 288) FStar.Seq.Base.createEmpty is deprecated, use Seq.empty instead
C:\build\agent2\_work\6\s\hacl-star\code\lib\kremlin\FStar.Endianness.fst(309,16-309,27): (Warning 288) FStar.Seq.Base.createEmpty is deprecated, use Seq.empty instead
C:\build\agent2\_work\6\s\hacl-star\code\lib\kremlin\FStar.Endianness.fst(330,16-330,27): (Warning 288) FStar.Seq.Base.createEmpty is deprecated, use Seq.empty instead
C:\build\agent2\_work\6\s\hacl-star\code\lib\kremlin\FStar.Endianness.fst(354,8-354,19): (Warning 288) FStar.Seq.Base.createEmpty is deprecated, use Seq.empty instead
C:\build\agent2\_work\6\s\kremlin\kremlib\Spec.Loops.fst(14,8-14,19): (Warning 288) FStar.Seq.Base.createEmpty is deprecated, use Seq.empty instead
C:\build\agent2\_work\6\s\kremlin\kremlib\Spec.Loops.fst(28,31-28,42): (Warning 288) FStar.Seq.Base.createEmpty is deprecated, use Seq.empty instead
Spec.Lib.fst(108,18-108,29): (Warning 288) FStar.Seq.Base.createEmpty is deprecated, use Seq.empty instead
Spec.Lib.fst(125,18-125,29): (Warning 288) FStar.Seq.Base.createEmpty is deprecated, use Seq.empty instead
Spec.Lib.fst(134,18-134,29): (Warning 288) FStar.Seq.Base.createEmpty is deprecated, use Seq.empty instead
Spec.Lib.fst(142,18-142,29): (Warning 288) FStar.Seq.Base.createEmpty is deprecated, use Seq.empty instead
Spec.Lib.fst(152,18-152,29): (Warning 288) FStar.Seq.Base.createEmpty is deprecated, use Seq.empty instead
Spec.Lib.fst(160,18-160,29): (Warning 288) FStar.Seq.Base.createEmpty is deprecated, use Seq.empty instead
Spec.Lib.fst(169,18-169,29): (Warning 288) FStar.Seq.Base.createEmpty is deprecated, use Seq.empty instead
Spec.Lib.fst(177,18-177,29): (Warning 288) FStar.Seq.Base.createEmpty is deprecated, use Seq.empty instead
Spec.Lib.fst(188,32-188,43): (Warning 288) FStar.Seq.Base.createEmpty is deprecated, use Seq.empty instead
Spec.Lib.fst(198,30-198,41): (Warning 288) FStar.Seq.Base.createEmpty is deprecated, use Seq.empty instead
Spec.Lib.fst(207,32-207,43): (Warning 288) FStar.Seq.Base.createEmpty is deprecated, use Seq.empty instead
Spec.Lib.fst(217,30-217,41): (Warning 288) FStar.Seq.Base.createEmpty is deprecated, use Seq.empty instead
Spec.Lib.fst(226,32-226,43): (Warning 288) FStar.Seq.Base.createEmpty is deprecated, use Seq.empty instead
Spec.Lib.fst(236,30-236,41): (Warning 288) FStar.Seq.Base.createEmpty is deprecated, use Seq.empty instead
Spec.Lib.fst(281,35-281,46): (Warning 288) FStar.Seq.Base.createEmpty is deprecated, use Seq.empty instead
Spec.Lib.fst(330,37-330,48): (Warning 288) FStar.Seq.Base.createEmpty is deprecated, use Seq.empty instead
Spec.Lib.fst(361,65-361,76): (Warning 288) FStar.Seq.Base.createEmpty is deprecated, use Seq.empty instead
Spec.Lib.fst(362,45-362,56): (Warning 288) FStar.Seq.Base.createEmpty is deprecated, use Seq.empty instead
Spec.Lib.fst(387,55-387,66): (Warning 288) FStar.Seq.Base.createEmpty is deprecated, use Seq.empty instead
Spec.Lib.fst(388,43-388,54): (Warning 288) FStar.Seq.Base.createEmpty is deprecated, use Seq.empty instead
Warning 3: run_or_warn: the following command failed:
C:/build/agent2/_work/6/s/FStar/bin/fstar.exe --odir x25519-c --codegen Kremlin --lax --no_extract FStar.Monotonic.HyperStack --no_extract FStar.Buffer --no_extract FStar.Monotonic.HyperHeap --no_extract FStar.Map --no_extract FStar.Math.Lib --no_extract FStar.HyperHeap --no_extract FStar.HyperStack --no_extract FStar.HyperStack.ST --no_extract FStar.Seq.Base --no_extract FStar.Int128 --no_extract FStar.UInt64 --no_extract FStar.Int64 --no_extract FStar.UInt63 --no_extract FStar.Int63 --no_extract FStar.UInt32 --no_extract FStar.Int32 --no_extract FStar.UInt31 --no_extract FStar.Int31 --no_extract FStar.UInt16 --no_extract FStar.Int16 --no_extract FStar.UInt8 --no_extract FStar.Int8 --trace_error --include C:/build/agent2/_work/6/s/hacl-star/code/lib/kremlin --include C:/build/agent2/_work/6/s/kremlin/kremlib --include C:/build/agent2/_work/6/s/hacl-star/specs --include . --include ../bignum --include C:/build/agent2/_work/6/s/kremlin/kremlib ../bignum/Hacl.Bignum.Fdifference.fst ../bignum/Hacl.Bignum.Fmul.fst ../bignum/Hacl.Bignum.Fproduct.fst ../bignum/Hacl.Bignum.Fscalar.fst ../bignum/Hacl.Bignum.Fsum.fst ../bignum/Hacl.Bignum.Limb.fst ../bignum/Hacl.Bignum.Wide.fst ../bignum/Hacl.Bignum.fst ../bignum/Hacl.Spec.Bignum.Bigint.fst ../bignum/Hacl.Spec.Bignum.Fdifference.fst ../bignum/Hacl.Spec.Bignum.Field.fst ../bignum/Hacl.Spec.Bignum.Fmul.fst ../bignum/Hacl.Spec.Bignum.Fproduct.fst ../bignum/Hacl.Spec.Bignum.Fscalar.fst ../bignum/Hacl.Spec.Bignum.Fsum.fst ../bignum/Hacl.Spec.Bignum.fst Hacl.Spec.Curve25519.Lemmas.fst Hacl.Bignum.Parameters.fst Hacl.Spec.Bignum.Modulo.fst Hacl.Spec.EC.AddAndDouble.fst Hacl.Spec.Bignum.Fsquare.fst Hacl.Spec.Bignum.Crecip.fst Hacl.Bignum.Modulo.fst Hacl.Bignum.Fsquare.fst Hacl.Bignum.Crecip.fst Hacl.Spec.EC.Point.fst Hacl.EC.Point.fst Hacl.Spec.EC.AddAndDouble2.fst Hacl.Spec.EC.AddAndDouble3.fst Hacl.Spec.EC.Format.Lemmas.fst Hacl.Spec.EC.Format.fst Hacl.EC.Format.fst Hacl.EC.AddAndDouble.fst Hacl.Spec.EC.Ladder.Lemmas.fst Hacl.Spec.EC.Ladder.fst Hacl.EC.Ladder.SmallLoop.fst Hacl.EC.Ladder.BigLoop.fst Hacl.EC.Ladder.fst Hacl.Spec.EC.fst Hacl.EC.fst Hacl.Curve25519.fst Hacl.Test.X25519.fst
F* failed
Fatal error: exception Warnings.Fatal("Unrecoverable error")
Raised at file "src/Warnings.ml", line 49, characters 4-39
Called from file "src/Driver.ml", line 287, characters 6-29
Called from file "src/Kremlin.ml", line 326, characters 14-96
make[5]: *** [Makefile:95: x25519-c/out.krml] Error 2
make[5]: Target 'extract-c' not remade because of errors.
make[4]: *** [Makefile:9: curve25519-c] Error 2
Warning 3: run_or_warn: the following command failed:
C:/build/agent2/_work/6/s/FStar/bin/fstar.exe --odir hmac-c --codegen Kremlin --lax --no_extract FStar.Monotonic.HyperStack --no_extract FStar.Buffer --no_extract FStar.Monotonic.HyperHeap --no_extract FStar.Map --no_extract FStar.Math.Lib --no_extract FStar.HyperHeap --no_extract FStar.HyperStack --no_extract FStar.HyperStack.ST --no_extract FStar.Seq.Base --no_extract FStar.Int128 --no_extract FStar.UInt64 --no_extract FStar.Int64 --no_extract FStar.UInt63 --no_extract FStar.Int63 --no_extract FStar.UInt32 --no_extract FStar.Int32 --no_extract FStar.UInt31 --no_extract FStar.Int31 --no_extract FStar.UInt16 --no_extract FStar.Int16 --no_extract FStar.UInt8 --no_extract FStar.Int8 --trace_error --include C:/build/agent2/_work/6/s/hacl-star/code/lib/kremlin --include C:/build/agent2/_work/6/s/kremlin/kremlib --include C:/build/agent2/_work/6/s/hacl-star/specs --include . --include C:/build/agent2/_work/6/s/hacl-star/code/hash --include C:/build/agent2/_work/6/s/kremlin/kremlib Hacl.HMAC.SHA2_256.fst Hacl.Test.HMAC.SHA2_256.fst
F* failed
Fatal error: exception Warnings.Fatal("Unrecoverable error")
Raised at file "src/Warnings.ml", line 49, characters 4-39
Called from file "src/Driver.ml", line 287, characters 6-29
Called from file "src/Kremlin.ml", line 326, characters 14-96
make[5]: *** [Makefile:43: hmac-c/out.krml] Error 2
make[5]: Target 'extract-c' not remade because of errors.
make[4]: *** [Makefile:9: hmac-c] Error 2
make[4]: Target 'extract-c' not remade because of errors.
make[3]: *** [Makefile.build:22: extract-c-code] Error 2
make[2]: *** [Makefile.build:77: snapshots/snapshot-gcc] Error 2
make[1]: *** [Makefile.build:149: snapshots-intermediates] Error 2
make: *** [Makefile:99: extract-all] Error 2
C:\build\agent2\_work\6\s\kremlin\kremlib\Spec.Loops.fst(14,8-14,19): (Warning 288) FStar.Seq.Base.createEmpty is deprecated, use Seq.empty instead
C:\build\agent2\_work\6\s\kremlin\kremlib\Spec.Loops.fst(28,31-28,42): (Warning 288) FStar.Seq.Base.createEmpty is deprecated, use Seq.empty instead
C:\build\agent2\_work\6\s\hacl-star\code\lib\kremlin\FStar.Endianness.fst(190,8-190,19): (Warning 288) FStar.Seq.Base.createEmpty is deprecated, use Seq.empty instead
C:\build\agent2\_work\6\s\hacl-star\code\lib\kremlin\FStar.Endianness.fst(309,16-309,27): (Warning 288) FStar.Seq.Base.createEmpty is deprecated, use Seq.empty instead
C:\build\agent2\_work\6\s\hacl-star\code\lib\kremlin\FStar.Endianness.fst(330,16-330,27): (Warning 288) FStar.Seq.Base.createEmpty is deprecated, use Seq.empty instead
C:\build\agent2\_work\6\s\hacl-star\code\lib\kremlin\FStar.Endianness.fst(354,8-354,19): (Warning 288) FStar.Seq.Base.createEmpty is deprecated, use Seq.empty instead
Spec.Lib.fst(108,18-108,29): (Warning 288) FStar.Seq.Base.createEmpty is deprecated, use Seq.empty instead
Spec.Lib.fst(125,18-125,29): (Warning 288) FStar.Seq.Base.createEmpty is deprecated, use Seq.empty instead
Spec.Lib.fst(134,18-134,29): (Warning 288) FStar.Seq.Base.createEmpty is deprecated, use Seq.empty instead
Spec.Lib.fst(142,18-142,29): (Warning 288) FStar.Seq.Base.createEmpty is deprecated, use Seq.empty instead
Spec.Lib.fst(152,18-152,29): (Warning 288) FStar.Seq.Base.createEmpty is deprecated, use Seq.empty instead
Spec.Lib.fst(160,18-160,29): (Warning 288) FStar.Seq.Base.createEmpty is deprecated, use Seq.empty instead
Spec.Lib.fst(169,18-169,29): (Warning 288) FStar.Seq.Base.createEmpty is deprecated, use Seq.empty instead
Spec.Lib.fst(177,18-177,29): (Warning 288) FStar.Seq.Base.createEmpty is deprecated, use Seq.empty instead
Spec.Lib.fst(188,32-188,43): (Warning 288) FStar.Seq.Base.createEmpty is deprecated, use Seq.empty instead
Spec.Lib.fst(198,30-198,41): (Warning 288) FStar.Seq.Base.createEmpty is deprecated, use Seq.empty instead
Spec.Lib.fst(207,32-207,43): (Warning 288) FStar.Seq.Base.createEmpty is deprecated, use Seq.empty instead
Spec.Lib.fst(217,30-217,41): (Warning 288) FStar.Seq.Base.createEmpty is deprecated, use Seq.empty instead
Spec.Lib.fst(226,32-226,43): (Warning 288) FStar.Seq.Base.createEmpty is deprecated, use Seq.empty instead
Spec.Lib.fst(236,30-236,41): (Warning 288) FStar.Seq.Base.createEmpty is deprecated, use Seq.empty instead
Spec.Lib.fst(281,35-281,46): (Warning 288) FStar.Seq.Base.createEmpty is deprecated, use Seq.empty instead
Spec.Lib.fst(330,37-330,48): (Warning 288) FStar.Seq.Base.createEmpty is deprecated, use Seq.empty instead
Spec.Lib.fst(361,65-361,76): (Warning 288) FStar.Seq.Base.createEmpty is deprecated, use Seq.empty instead
Spec.Lib.fst(362,45-362,56): (Warning 288) FStar.Seq.Base.createEmpty is deprecated, use Seq.empty instead
Spec.Lib.fst(387,55-387,66): (Warning 288) FStar.Seq.Base.createEmpty is deprecated, use Seq.empty instead
Spec.Lib.fst(388,43-388,54): (Warning 288) FStar.Seq.Base.createEmpty is deprecated, use Seq.empty instead
Spec.CTR.fst(41,22-41,33): (Warning 288) FStar.Seq.Base.createEmpty is deprecated, use Seq.empty instead
Spec.CTR.fst(82,9-82,20): (Warning 288) FStar.Seq.Base.createEmpty is deprecated, use Seq.empty instead
C:\build\agent2\_work\6\s\kremlin\kremlib\Spec.Loops.fst(14,8-14,19): (Warning 288) FStar.Seq.Base.createEmpty is deprecated, use Seq.empty instead
C:\build\agent2\_work\6\s\kremlin\kremlib\Spec.Loops.fst(28,31-28,42): (Warning 288) FStar.Seq.Base.createEmpty is deprecated, use Seq.empty instead
C:\build\agent2\_work\6\s\hacl-star\code\lib\kremlin\FStar.Endianness.fst(190,8-190,19): (Warning 288) FStar.Seq.Base.createEmpty is deprecated, use Seq.empty instead
C:\build\agent2\_work\6\s\hacl-star\code\lib\kremlin\FStar.Endianness.fst(309,16-309,27): (Warning 288) FStar.Seq.Base.createEmpty is deprecated, use Seq.empty instead
C:\build\agent2\_work\6\s\hacl-star\code\lib\kremlin\FStar.Endianness.fst(330,16-330,27): (Warning 288) FStar.Seq.Base.createEmpty is deprecated, use Seq.empty instead
C:\build\agent2\_work\6\s\hacl-star\code\lib\kremlin\FStar.Endianness.fst(354,8-354,19): (Warning 288) FStar.Seq.Base.createEmpty is deprecated, use Seq.empty instead
Spec.Lib.fst(108,18-108,29): (Warning 288) FStar.Seq.Base.createEmpty is deprecated, use Seq.empty instead
Spec.Lib.fst(125,18-125,29): (Warning 288) FStar.Seq.Base.createEmpty is deprecated, use Seq.empty instead
Spec.Lib.fst(134,18-134,29): (Warning 288) FStar.Seq.Base.createEmpty is deprecated, use Seq.empty instead
Spec.Lib.fst(142,18-142,29): (Warning 288) FStar.Seq.Base.createEmpty is deprecated, use Seq.empty instead
Spec.Lib.fst(152,18-152,29): (Warning 288) FStar.Seq.Base.createEmpty is deprecated, use Seq.empty instead
Spec.Lib.fst(160,18-160,29): (Warning 288) FStar.Seq.Base.createEmpty is deprecated, use Seq.empty instead
Spec.Lib.fst(169,18-169,29): (Warning 288) FStar.Seq.Base.createEmpty is deprecated, use Seq.empty instead
Spec.Lib.fst(177,18-177,29): (Warning 288) FStar.Seq.Base.createEmpty is deprecated, use Seq.empty instead
Spec.Lib.fst(188,32-188,43): (Warning 288) FStar.Seq.Base.createEmpty is deprecated, use Seq.empty instead
Spec.Lib.fst(198,30-198,41): (Warning 288) FStar.Seq.Base.createEmpty is deprecated, use Seq.empty instead
Spec.Lib.fst(207,32-207,43): (Warning 288) FStar.Seq.Base.createEmpty is deprecated, use Seq.empty instead
Spec.Lib.fst(217,30-217,41): (Warning 288) FStar.Seq.Base.createEmpty is deprecated, use Seq.empty instead
Spec.Lib.fst(226,32-226,43): (Warning 288) FStar.Seq.Base.createEmpty is deprecated, use Seq.empty instead
Spec.Lib.fst(236,30-236,41): (Warning 288) FStar.Seq.Base.createEmpty is deprecated, use Seq.empty instead
Spec.Lib.fst(281,35-281,46): (Warning 288) FStar.Seq.Base.createEmpty is deprecated, use Seq.empty instead
Spec.Lib.fst(330,37-330,48): (Warning 288) FStar.Seq.Base.createEmpty is deprecated, use Seq.empty instead
Spec.Lib.fst(361,65-361,76): (Warning 288) FStar.Seq.Base.createEmpty is deprecated, use Seq.empty instead
Spec.Lib.fst(362,45-362,56): (Warning 288) FStar.Seq.Base.createEmpty is deprecated, use Seq.empty instead
Spec.Lib.fst(387,55-387,66): (Warning 288) FStar.Seq.Base.createEmpty is deprecated, use Seq.empty instead
Spec.Lib.fst(388,43-388,54): (Warning 288) FStar.Seq.Base.createEmpty is deprecated, use Seq.empty instead
Spec.CTR.fst(41,22-41,33): (Warning 288) FStar.Seq.Base.createEmpty is deprecated, use Seq.empty instead
Spec.CTR.fst(82,9-82,20): (Warning 288) FStar.Seq.Base.createEmpty is deprecated, use Seq.empty instead
C:\build\agent2\_work\6\s\hacl-star\code\lib\kremlin\FStar.Endianness.fst(190,8-190,19): (Warning 288) FStar.Seq.Base.createEmpty is deprecated, use Seq.empty instead
C:\build\agent2\_work\6\s\hacl-star\code\lib\kremlin\FStar.Endianness.fst(309,16-309,27): (Warning 288) FStar.Seq.Base.createEmpty is deprecated, use Seq.empty instead
C:\build\agent2\_work\6\s\hacl-star\code\lib\kremlin\FStar.Endianness.fst(330,16-330,27): (Warning 288) FStar.Seq.Base.createEmpty is deprecated, use Seq.empty instead
C:\build\agent2\_work\6\s\hacl-star\code\lib\kremlin\FStar.Endianness.fst(354,8-354,19): (Warning 288) FStar.Seq.Base.createEmpty is deprecated, use Seq.empty instead
C:\build\agent2\_work\6\s\kremlin\kremlib\Spec.Loops.fst(14,8-14,19): (Warning 288) FStar.Seq.Base.createEmpty is deprecated, use Seq.empty instead
C:\build\agent2\_work\6\s\kremlin\kremlib\Spec.Loops.fst(28,31-28,42): (Warning 288) FStar.Seq.Base.createEmpty is deprecated, use Seq.empty instead
Spec.Lib.fst(108,18-108,29): (Warning 288) FStar.Seq.Base.createEmpty is deprecated, use Seq.empty instead
Spec.Lib.fst(125,18-125,29): (Warning 288) FStar.Seq.Base.createEmpty is deprecated, use Seq.empty instead
Spec.Lib.fst(134,18-134,29): (Warning 288) FStar.Seq.Base.createEmpty is deprecated, use Seq.empty instead
Spec.Lib.fst(142,18-142,29): (Warning 288) FStar.Seq.Base.createEmpty is deprecated, use Seq.empty instead
Spec.Lib.fst(152,18-152,29): (Warning 288) FStar.Seq.Base.createEmpty is deprecated, use Seq.empty instead
Spec.Lib.fst(160,18-160,29): (Warning 288) FStar.Seq.Base.createEmpty is deprecated, use Seq.empty instead
Spec.Lib.fst(169,18-169,29): (Warning 288) FStar.Seq.Base.createEmpty is deprecated, use Seq.empty instead
Spec.Lib.fst(177,18-177,29): (Warning 288) FStar.Seq.Base.createEmpty is deprecated, use Seq.empty instead
Spec.Lib.fst(188,32-188,43): (Warning 288) FStar.Seq.Base.createEmpty is deprecated, use Seq.empty instead
Spec.Lib.fst(198,30-198,41): (Warning 288) FStar.Seq.Base.createEmpty is deprecated, use Seq.empty instead
Spec.Lib.fst(207,32-207,43): (Warning 288) FStar.Seq.Base.createEmpty is deprecated, use Seq.empty instead
Spec.Lib.fst(217,30-217,41): (Warning 288) FStar.Seq.Base.createEmpty is deprecated, use Seq.empty instead
Spec.Lib.fst(226,32-226,43): (Warning 288) FStar.Seq.Base.createEmpty is deprecated, use Seq.empty instead
Spec.Lib.fst(236,30-236,41): (Warning 288) FStar.Seq.Base.createEmpty is deprecated, use Seq.empty instead
Spec.Lib.fst(281,35-281,46): (Warning 288) FStar.Seq.Base.createEmpty is deprecated, use Seq.empty instead
Spec.Lib.fst(330,37-330,48): (Warning 288) FStar.Seq.Base.createEmpty is deprecated, use Seq.empty instead
Spec.Lib.fst(361,65-361,76): (Warning 288) FStar.Seq.Base.createEmpty is deprecated, use Seq.empty instead
Spec.Lib.fst(362,45-362,56): (Warning 288) FStar.Seq.Base.createEmpty is deprecated, use Seq.empty instead
Spec.Lib.fst(387,55-387,66): (Warning 288) FStar.Seq.Base.createEmpty is deprecated, use Seq.empty instead
Spec.Lib.fst(388,43-388,54): (Warning 288) FStar.Seq.Base.createEmpty is deprecated, use Seq.empty instead
Spec.SHA2_256.fst(336,28-336,39): (Warning 288) FStar.Seq.Base.createEmpty is deprecated, use Seq.empty instead
C:\build\agent2\_work\6\s\hacl-star\code\lib\kremlin\FStar.Endianness.fst(190,8-190,19): (Warning 288) FStar.Seq.Base.createEmpty is deprecated, use Seq.empty instead
C:\build\agent2\_work\6\s\hacl-star\code\lib\kremlin\FStar.Endianness.fst(309,16-309,27): (Warning 288) FStar.Seq.Base.createEmpty is deprecated, use Seq.empty instead
C:\build\agent2\_work\6\s\hacl-star\code\lib\kremlin\FStar.Endianness.fst(330,16-330,27): (Warning 288) FStar.Seq.Base.createEmpty is deprecated, use Seq.empty instead
C:\build\agent2\_work\6\s\hacl-star\code\lib\kremlin\FStar.Endianness.fst(354,8-354,19): (Warning 288) FStar.Seq.Base.createEmpty is deprecated, use Seq.empty instead
C:\build\agent2\_work\6\s\kremlin\kremlib\Spec.Loops.fst(14,8-14,19): (Warning 288) FStar.Seq.Base.createEmpty is deprecated, use Seq.empty instead
C:\build\agent2\_work\6\s\kremlin\kremlib\Spec.Loops.fst(28,31-28,42): (Warning 288) FStar.Seq.Base.createEmpty is deprecated, use Seq.empty instead
Spec.Lib.fst(108,18-108,29): (Warning 288) FStar.Seq.Base.createEmpty is deprecated, use Seq.empty instead
Spec.Lib.fst(125,18-125,29): (Warning 288) FStar.Seq.Base.createEmpty is deprecated, use Seq.empty instead
Spec.Lib.fst(134,18-134,29): (Warning 288) FStar.Seq.Base.createEmpty is deprecated, use Seq.empty instead
Spec.Lib.fst(142,18-142,29): (Warning 288) FStar.Seq.Base.createEmpty is deprecated, use Seq.empty instead
Spec.Lib.fst(152,18-152,29): (Warning 288) FStar.Seq.Base.createEmpty is deprecated, use Seq.empty instead
Spec.Lib.fst(160,18-160,29): (Warning 288) FStar.Seq.Base.createEmpty is deprecated, use Seq.empty instead
Spec.Lib.fst(169,18-169,29): (Warning 288) FStar.Seq.Base.createEmpty is deprecated, use Seq.empty instead
Spec.Lib.fst(177,18-177,29): (Warning 288) FStar.Seq.Base.createEmpty is deprecated, use Seq.empty instead
Spec.Lib.fst(188,32-188,43): (Warning 288) FStar.Seq.Base.createEmpty is deprecated, use Seq.empty instead
Spec.Lib.fst(198,30-198,41): (Warning 288) FStar.Seq.Base.createEmpty is deprecated, use Seq.empty instead
Spec.Lib.fst(207,32-207,43): (Warning 288) FStar.Seq.Base.createEmpty is deprecated, use Seq.empty instead
Spec.Lib.fst(217,30-217,41): (Warning 288) FStar.Seq.Base.createEmpty is deprecated, use Seq.empty instead
Spec.Lib.fst(226,32-226,43): (Warning 288) FStar.Seq.Base.createEmpty is deprecated, use Seq.empty instead
Spec.Lib.fst(236,30-236,41): (Warning 288) FStar.Seq.Base.createEmpty is deprecated, use Seq.empty instead
Spec.Lib.fst(281,35-281,46): (Warning 288) FStar.Seq.Base.createEmpty is deprecated, use Seq.empty instead
Spec.Lib.fst(330,37-330,48): (Warning 288) FStar.Seq.Base.createEmpty is deprecated, use Seq.empty instead
Spec.Lib.fst(361,65-361,76): (Warning 288) FStar.Seq.Base.createEmpty is deprecated, use Seq.empty instead
Spec.Lib.fst(362,45-362,56): (Warning 288) FStar.Seq.Base.createEmpty is deprecated, use Seq.empty instead
Spec.Lib.fst(387,55-387,66): (Warning 288) FStar.Seq.Base.createEmpty is deprecated, use Seq.empty instead
Spec.Lib.fst(388,43-388,54): (Warning 288) FStar.Seq.Base.createEmpty is deprecated, use Seq.empty instead
Spec.SHA2_256.fst(336,28-336,39): (Warning 288) FStar.Seq.Base.createEmpty is deprecated, use Seq.empty instead
C:\build\agent2\_work\6\s\hacl-star\code\lib\kremlin\FStar.Endianness.fst(190,8-190,19): (Warning 288) FStar.Seq.Base.createEmpty is deprecated, use Seq.empty instead
C:\build\agent2\_work\6\s\hacl-star\code\lib\kremlin\FStar.Endianness.fst(309,16-309,27): (Warning 288) FStar.Seq.Base.createEmpty is deprecated, use Seq.empty instead
C:\build\agent2\_work\6\s\hacl-star\code\lib\kremlin\FStar.Endianness.fst(330,16-330,27): (Warning 288) FStar.Seq.Base.createEmpty is deprecated, use Seq.empty instead
C:\build\agent2\_work\6\s\hacl-star\code\lib\kremlin\FStar.Endianness.fst(354,8-354,19): (Warning 288) FStar.Seq.Base.createEmpty is deprecated, use Seq.empty instead
C:\build\agent2\_work\6\s\kremlin\kremlib\Spec.Loops.fst(14,8-14,19): (Warning 288) FStar.Seq.Base.createEmpty is deprecated, use Seq.empty instead
C:\build\agent2\_work\6\s\kremlin\kremlib\Spec.Loops.fst(28,31-28,42): (Warning 288) FStar.Seq.Base.createEmpty is deprecated, use Seq.empty instead
Spec.Lib.fst(108,18-108,29): (Warning 288) FStar.Seq.Base.createEmpty is deprecated, use Seq.empty instead
Spec.Lib.fst(125,18-125,29): (Warning 288) FStar.Seq.Base.createEmpty is deprecated, use Seq.empty instead
Spec.Lib.fst(134,18-134,29): (Warning 288) FStar.Seq.Base.createEmpty is deprecated, use Seq.empty instead
Spec.Lib.fst(142,18-142,29): (Warning 288) FStar.Seq.Base.createEmpty is deprecated, use Seq.empty instead
Spec.Lib.fst(152,18-152,29): (Warning 288) FStar.Seq.Base.createEmpty is deprecated, use Seq.empty instead
Spec.Lib.fst(160,18-160,29): (Warning 288) FStar.Seq.Base.createEmpty is deprecated, use Seq.empty instead
Spec.Lib.fst(169,18-169,29): (Warning 288) FStar.Seq.Base.createEmpty is deprecated, use Seq.empty instead
Spec.Lib.fst(177,18-177,29): (Warning 288) FStar.Seq.Base.createEmpty is deprecated, use Seq.empty instead
Spec.Lib.fst(188,32-188,43): (Warning 288) FStar.Seq.Base.createEmpty is deprecated, use Seq.empty instead
Spec.Lib.fst(198,30-198,41): (Warning 288) FStar.Seq.Base.createEmpty is deprecated, use Seq.empty instead
Spec.Lib.fst(207,32-207,43): (Warning 288) FStar.Seq.Base.createEmpty is deprecated, use Seq.empty instead
Spec.Lib.fst(217,30-217,41): (Warning 288) FStar.Seq.Base.createEmpty is deprecated, use Seq.empty instead
Spec.Lib.fst(226,32-226,43): (Warning 288) FStar.Seq.Base.createEmpty is deprecated, use Seq.empty instead
Spec.Lib.fst(236,30-236,41): (Warning 288) FStar.Seq.Base.createEmpty is deprecated, use Seq.empty instead
Spec.Lib.fst(281,35-281,46): (Warning 288) FStar.Seq.Base.createEmpty is deprecated, use Seq.empty instead
Spec.Lib.fst(330,37-330,48): (Warning 288) FStar.Seq.Base.createEmpty is deprecated, use Seq.empty instead
Spec.Lib.fst(361,65-361,76): (Warning 288) FStar.Seq.Base.createEmpty is deprecated, use Seq.empty instead
Spec.Lib.fst(362,45-362,56): (Warning 288) FStar.Seq.Base.createEmpty is deprecated, use Seq.empty instead
Spec.Lib.fst(387,55-387,66): (Warning 288) FStar.Seq.Base.createEmpty is deprecated, use Seq.empty instead
Spec.Lib.fst(388,43-388,54): (Warning 288) FStar.Seq.Base.createEmpty is deprecated, use Seq.empty instead
C:\build\agent2\_work\6\s\hacl-star\code\lib\kremlin\FStar.Endianness.fst(190,8-190,19): (Warning 288) FStar.Seq.Base.createEmpty is deprecated, use Seq.empty instead
C:\build\agent2\_work\6\s\hacl-star\code\lib\kremlin\FStar.Endianness.fst(309,16-309,27): (Warning 288) FStar.Seq.Base.createEmpty is deprecated, use Seq.empty instead
C:\build\agent2\_work\6\s\hacl-star\code\lib\kremlin\FStar.Endianness.fst(330,16-330,27): (Warning 288) FStar.Seq.Base.createEmpty is deprecated, use Seq.empty instead
C:\build\agent2\_work\6\s\hacl-star\code\lib\kremlin\FStar.Endianness.fst(354,8-354,19): (Warning 288) FStar.Seq.Base.createEmpty is deprecated, use Seq.empty instead
C:\build\agent2\_work\6\s\kremlin\kremlib\Spec.Loops.fst(14,8-14,19): (Warning 288) FStar.Seq.Base.createEmpty is deprecated, use Seq.empty instead
C:\build\agent2\_work\6\s\kremlin\kremlib\Spec.Loops.fst(28,31-28,42): (Warning 288) FStar.Seq.Base.createEmpty is deprecated, use Seq.empty instead
Spec.Lib.fst(108,18-108,29): (Warning 288) FStar.Seq.Base.createEmpty is deprecated, use Seq.empty instead
Spec.Lib.fst(125,18-125,29): (Warning 288) FStar.Seq.Base.createEmpty is deprecated, use Seq.empty instead
Spec.Lib.fst(134,18-134,29): (Warning 288) FStar.Seq.Base.createEmpty is deprecated, use Seq.empty instead
Spec.Lib.fst(142,18-142,29): (Warning 288) FStar.Seq.Base.createEmpty is deprecated, use Seq.empty instead
Spec.Lib.fst(152,18-152,29): (Warning 288) FStar.Seq.Base.createEmpty is deprecated, use Seq.empty instead
Spec.Lib.fst(160,18-160,29): (Warning 288) FStar.Seq.Base.createEmpty is deprecated, use Seq.empty instead
Spec.Lib.fst(169,18-169,29): (Warning 288) FStar.Seq.Base.createEmpty is deprecated, use Seq.empty instead
Spec.Lib.fst(177,18-177,29): (Warning 288) FStar.Seq.Base.createEmpty is deprecated, use Seq.empty instead
Spec.Lib.fst(188,32-188,43): (Warning 288) FStar.Seq.Base.createEmpty is deprecated, use Seq.empty instead
Spec.Lib.fst(198,30-198,41): (Warning 288) FStar.Seq.Base.createEmpty is deprecated, use Seq.empty instead
Spec.Lib.fst(207,32-207,43): (Warning 288) FStar.Seq.Base.createEmpty is deprecated, use Seq.empty instead
Spec.Lib.fst(217,30-217,41): (Warning 288) FStar.Seq.Base.createEmpty is deprecated, use Seq.empty instead
Spec.Lib.fst(226,32-226,43): (Warning 288) FStar.Seq.Base.createEmpty is deprecated, use Seq.empty instead
Spec.Lib.fst(236,30-236,41): (Warning 288) FStar.Seq.Base.createEmpty is deprecated, use Seq.empty instead
Spec.Lib.fst(281,35-281,46): (Warning 288) FStar.Seq.Base.createEmpty is deprecated, use Seq.empty instead
Spec.Lib.fst(330,37-330,48): (Warning 288) FStar.Seq.Base.createEmpty is deprecated, use Seq.empty instead
Spec.Lib.fst(361,65-361,76): (Warning 288) FStar.Seq.Base.createEmpty is deprecated, use Seq.empty instead
Spec.Lib.fst(362,45-362,56): (Warning 288) FStar.Seq.Base.createEmpty is deprecated, use Seq.empty instead
Spec.Lib.fst(387,55-387,66): (Warning 288) FStar.Seq.Base.createEmpty is deprecated, use Seq.empty instead
Spec.Lib.fst(388,43-388,54): (Warning 288) FStar.Seq.Base.createEmpty is deprecated, use Seq.empty instead
C:\build\agent2\_work\6\s\hacl-star\code\lib\kremlin\FStar.Endianness.fst(190,8-190,19): (Warning 288) FStar.Seq.Base.createEmpty is deprecated, use Seq.empty instead
C:\build\agent2\_work\6\s\hacl-star\code\lib\kremlin\FStar.Endianness.fst(309,16-309,27): (Warning 288) FStar.Seq.Base.createEmpty is deprecated, use Seq.empty instead
C:\build\agent2\_work\6\s\hacl-star\code\lib\kremlin\FStar.Endianness.fst(330,16-330,27): (Warning 288) FStar.Seq.Base.createEmpty is deprecated, use Seq.empty instead
C:\build\agent2\_work\6\s\hacl-star\code\lib\kremlin\FStar.Endianness.fst(354,8-354,19): (Warning 288) FStar.Seq.Base.createEmpty is deprecated, use Seq.empty instead
C:\build\agent2\_work\6\s\kremlin\kremlib\Spec.Loops.fst(14,8-14,19): (Warning 288) FStar.Seq.Base.createEmpty is deprecated, use Seq.empty instead
C:\build\agent2\_work\6\s\kremlin\kremlib\Spec.Loops.fst(28,31-28,42): (Warning 288) FStar.Seq.Base.createEmpty is deprecated, use Seq.empty instead
Spec.Lib.fst(108,18-108,29): (Warning 288) FStar.Seq.Base.createEmpty is deprecated, use Seq.empty instead
Spec.Lib.fst(125,18-125,29): (Warning 288) FStar.Seq.Base.createEmpty is deprecated, use Seq.empty instead
Spec.Lib.fst(134,18-134,29): (Warning 288) FStar.Seq.Base.createEmpty is deprecated, use Seq.empty instead
Spec.Lib.fst(142,18-142,29): (Warning 288) FStar.Seq.Base.createEmpty is deprecated, use Seq.empty instead
Spec.Lib.fst(152,18-152,29): (Warning 288) FStar.Seq.Base.createEmpty is deprecated, use Seq.empty instead
Spec.Lib.fst(160,18-160,29): (Warning 288) FStar.Seq.Base.createEmpty is deprecated, use Seq.empty instead
Spec.Lib.fst(169,18-169,29): (Warning 288) FStar.Seq.Base.createEmpty is deprecated, use Seq.empty instead
Spec.Lib.fst(177,18-177,29): (Warning 288) FStar.Seq.Base.createEmpty is deprecated, use Seq.empty instead
Spec.Lib.fst(188,32-188,43): (Warning 288) FStar.Seq.Base.createEmpty is deprecated, use Seq.empty instead
Spec.Lib.fst(198,30-198,41): (Warning 288) FStar.Seq.Base.createEmpty is deprecated, use Seq.empty instead
Spec.Lib.fst(207,32-207,43): (Warning 288) FStar.Seq.Base.createEmpty is deprecated, use Seq.empty instead
Spec.Lib.fst(217,30-217,41): (Warning 288) FStar.Seq.Base.createEmpty is deprecated, use Seq.empty instead
Spec.Lib.fst(226,32-226,43): (Warning 288) FStar.Seq.Base.createEmpty is deprecated, use Seq.empty instead
Spec.Lib.fst(236,30-236,41): (Warning 288) FStar.Seq.Base.createEmpty is deprecated, use Seq.empty instead
Spec.Lib.fst(281,35-281,46): (Warning 288) FStar.Seq.Base.createEmpty is deprecated, use Seq.empty instead
Spec.Lib.fst(330,37-330,48): (Warning 288) FStar.Seq.Base.createEmpty is deprecated, use Seq.empty instead
Spec.Lib.fst(361,65-361,76): (Warning 288) FStar.Seq.Base.createEmpty is deprecated, use Seq.empty instead
Spec.Lib.fst(362,45-362,56): (Warning 288) FStar.Seq.Base.createEmpty is deprecated, use Seq.empty instead
Spec.Lib.fst(387,55-387,66): (Warning 288) FStar.Seq.Base.createEmpty is deprecated, use Seq.empty instead
Spec.Lib.fst(388,43-388,54): (Warning 288) FStar.Seq.Base.createEmpty is deprecated, use Seq.empty instead
C:\build\agent2\_work\6\s\hacl-star\code\lib\kremlin\FStar.Endianness.fst(190,8-190,19): (Warning 288) FStar.Seq.Base.createEmpty is deprecated, use Seq.empty instead
C:\build\agent2\_work\6\s\hacl-star\code\lib\kremlin\FStar.Endianness.fst(309,16-309,27): (Warning 288) FStar.Seq.Base.createEmpty is deprecated, use Seq.empty instead
C:\build\agent2\_work\6\s\hacl-star\code\lib\kremlin\FStar.Endianness.fst(330,16-330,27): (Warning 288) FStar.Seq.Base.createEmpty is deprecated, use Seq.empty instead
C:\build\agent2\_work\6\s\hacl-star\code\lib\kremlin\FStar.Endianness.fst(354,8-354,19): (Warning 288) FStar.Seq.Base.createEmpty is deprecated, use Seq.empty instead
C:\build\agent2\_work\6\s\kremlin\kremlib\Spec.Loops.fst(14,8-14,19): (Warning 288) FStar.Seq.Base.createEmpty is deprecated, use Seq.empty instead
C:\build\agent2\_work\6\s\kremlin\kremlib\Spec.Loops.fst(28,31-28,42): (Warning 288) FStar.Seq.Base.createEmpty is deprecated, use Seq.empty instead
Spec.Lib.fst(108,18-108,29): (Warning 288) FStar.Seq.Base.createEmpty is deprecated, use Seq.empty instead
Spec.Lib.fst(125,18-125,29): (Warning 288) FStar.Seq.Base.createEmpty is deprecated, use Seq.empty instead
Spec.Lib.fst(134,18-134,29): (Warning 288) FStar.Seq.Base.createEmpty is deprecated, use Seq.empty instead
Spec.Lib.fst(142,18-142,29): (Warning 288) FStar.Seq.Base.createEmpty is deprecated, use Seq.empty instead
Spec.Lib.fst(152,18-152,29): (Warning 288) FStar.Seq.Base.createEmpty is deprecated, use Seq.empty instead
Spec.Lib.fst(160,18-160,29): (Warning 288) FStar.Seq.Base.createEmpty is deprecated, use Seq.empty instead
Spec.Lib.fst(169,18-169,29): (Warning 288) FStar.Seq.Base.createEmpty is deprecated, use Seq.empty instead
Spec.Lib.fst(177,18-177,29): (Warning 288) FStar.Seq.Base.createEmpty is deprecated, use Seq.empty instead
Spec.Lib.fst(188,32-188,43): (Warning 288) FStar.Seq.Base.createEmpty is deprecated, use Seq.empty instead
Spec.Lib.fst(198,30-198,41): (Warning 288) FStar.Seq.Base.createEmpty is deprecated, use Seq.empty instead
Spec.Lib.fst(207,32-207,43): (Warning 288) FStar.Seq.Base.createEmpty is deprecated, use Seq.empty instead
Spec.Lib.fst(217,30-217,41): (Warning 288) FStar.Seq.Base.createEmpty is deprecated, use Seq.empty instead
Spec.Lib.fst(226,32-226,43): (Warning 288) FStar.Seq.Base.createEmpty is deprecated, use Seq.empty instead
Spec.Lib.fst(236,30-236,41): (Warning 288) FStar.Seq.Base.createEmpty is deprecated, use Seq.empty instead
Spec.Lib.fst(281,35-281,46): (Warning 288) FStar.Seq.Base.createEmpty is deprecated, use Seq.empty instead
Spec.Lib.fst(330,37-330,48): (Warning 288) FStar.Seq.Base.createEmpty is deprecated, use Seq.empty instead
Spec.Lib.fst(361,65-361,76): (Warning 288) FStar.Seq.Base.createEmpty is deprecated, use Seq.empty instead
Spec.Lib.fst(362,45-362,56): (Warning 288) FStar.Seq.Base.createEmpty is deprecated, use Seq.empty instead
Spec.Lib.fst(387,55-387,66): (Warning 288) FStar.Seq.Base.createEmpty is deprecated, use Seq.empty instead
Spec.Lib.fst(388,43-388,54): (Warning 288) FStar.Seq.Base.createEmpty is deprecated, use Seq.empty instead
C:\build\agent2\_work\6\s\hacl-star\code\lib\kremlin\FStar.Endianness.fst(190,8-190,19): (Warning 288) FStar.Seq.Base.createEmpty is deprecated, use Seq.empty instead
C:\build\agent2\_work\6\s\hacl-star\code\lib\kremlin\FStar.Endianness.fst(309,16-309,27): (Warning 288) FStar.Seq.Base.createEmpty is deprecated, use Seq.empty instead
C:\build\agent2\_work\6\s\hacl-star\code\lib\kremlin\FStar.Endianness.fst(330,16-330,27): (Warning 288) FStar.Seq.Base.createEmpty is deprecated, use Seq.empty instead
C:\build\agent2\_work\6\s\hacl-star\code\lib\kremlin\FStar.Endianness.fst(354,8-354,19): (Warning 288) FStar.Seq.Base.createEmpty is deprecated, use Seq.empty instead
C:\build\agent2\_work\6\s\kremlin\kremlib\Spec.Loops.fst(14,8-14,19): (Warning 288) FStar.Seq.Base.createEmpty is deprecated, use Seq.empty instead
C:\build\agent2\_work\6\s\kremlin\kremlib\Spec.Loops.fst(28,31-28,42): (Warning 288) FStar.Seq.Base.createEmpty is deprecated, use Seq.empty instead
Spec.Lib.fst(108,18-108,29): (Warning 288) FStar.Seq.Base.createEmpty is deprecated, use Seq.empty instead
Spec.Lib.fst(125,18-125,29): (Warning 288) FStar.Seq.Base.createEmpty is deprecated, use Seq.empty instead
Spec.Lib.fst(134,18-134,29): (Warning 288) FStar.Seq.Base.createEmpty is deprecated, use Seq.empty instead
Spec.Lib.fst(142,18-142,29): (Warning 288) FStar.Seq.Base.createEmpty is deprecated, use Seq.empty instead
Spec.Lib.fst(152,18-152,29): (Warning 288) FStar.Seq.Base.createEmpty is deprecated, use Seq.empty instead
Spec.Lib.fst(160,18-160,29): (Warning 288) FStar.Seq.Base.createEmpty is deprecated, use Seq.empty instead
Spec.Lib.fst(169,18-169,29): (Warning 288) FStar.Seq.Base.createEmpty is deprecated, use Seq.empty instead
Spec.Lib.fst(177,18-177,29): (Warning 288) FStar.Seq.Base.createEmpty is deprecated, use Seq.empty instead
Spec.Lib.fst(188,32-188,43): (Warning 288) FStar.Seq.Base.createEmpty is deprecated, use Seq.empty instead
Spec.Lib.fst(198,30-198,41): (Warning 288) FStar.Seq.Base.createEmpty is deprecated, use Seq.empty instead
Spec.Lib.fst(207,32-207,43): (Warning 288) FStar.Seq.Base.createEmpty is deprecated, use Seq.empty instead
Spec.Lib.fst(217,30-217,41): (Warning 288) FStar.Seq.Base.createEmpty is deprecated, use Seq.empty instead
Spec.Lib.fst(226,32-226,43): (Warning 288) FStar.Seq.Base.createEmpty is deprecated, use Seq.empty instead
Spec.Lib.fst(236,30-236,41): (Warning 288) FStar.Seq.Base.createEmpty is deprecated, use Seq.empty instead
Spec.Lib.fst(281,35-281,46): (Warning 288) FStar.Seq.Base.createEmpty is deprecated, use Seq.empty instead
Spec.Lib.fst(330,37-330,48): (Warning 288) FStar.Seq.Base.createEmpty is deprecated, use Seq.empty instead
Spec.Lib.fst(361,65-361,76): (Warning 288) FStar.Seq.Base.createEmpty is deprecated, use Seq.empty instead
Spec.Lib.fst(362,45-362,56): (Warning 288) FStar.Seq.Base.createEmpty is deprecated, use Seq.empty instead
Spec.Lib.fst(387,55-387,66): (Warning 288) FStar.Seq.Base.createEmpty is deprecated, use Seq.empty instead
Spec.Lib.fst(388,43-388,54): (Warning 288) FStar.Seq.Base.createEmpty is deprecated, use Seq.empty instead
C:\build\agent2\_work\6\s\hacl-star\code\lib\kremlin\FStar.Endianness.fst(190,8-190,19): (Warning 288) FStar.Seq.Base.createEmpty is deprecated, use Seq.empty instead
C:\build\agent2\_work\6\s\hacl-star\code\lib\kremlin\FStar.Endianness.fst(309,16-309,27): (Warning 288) FStar.Seq.Base.createEmpty is deprecated, use Seq.empty instead
C:\build\agent2\_work\6\s\hacl-star\code\lib\kremlin\FStar.Endianness.fst(330,16-330,27): (Warning 288) FStar.Seq.Base.createEmpty is deprecated, use Seq.empty instead
C:\build\agent2\_work\6\s\hacl-star\code\lib\kremlin\FStar.Endianness.fst(354,8-354,19): (Warning 288) FStar.Seq.Base.createEmpty is deprecated, use Seq.empty instead
C:\build\agent2\_work\6\s\kremlin\kremlib\Spec.Loops.fst(14,8-14,19): (Warning 288) FStar.Seq.Base.createEmpty is deprecated, use Seq.empty instead
C:\build\agent2\_work\6\s\kremlin\kremlib\Spec.Loops.fst(28,31-28,42): (Warning 288) FStar.Seq.Base.createEmpty is deprecated, use Seq.empty instead
Spec.Lib.fst(108,18-108,29): (Warning 288) FStar.Seq.Base.createEmpty is deprecated, use Seq.empty instead
Spec.Lib.fst(125,18-125,29): (Warning 288) FStar.Seq.Base.createEmpty is deprecated, use Seq.empty instead
Spec.Lib.fst(134,18-134,29): (Warning 288) FStar.Seq.Base.createEmpty is deprecated, use Seq.empty instead
Spec.Lib.fst(142,18-142,29): (Warning 288) FStar.Seq.Base.createEmpty is deprecated, use Seq.empty instead
Spec.Lib.fst(152,18-152,29): (Warning 288) FStar.Seq.Base.createEmpty is deprecated, use Seq.empty instead
Spec.Lib.fst(160,18-160,29): (Warning 288) FStar.Seq.Base.createEmpty is deprecated, use Seq.empty instead
Spec.Lib.fst(169,18-169,29): (Warning 288) FStar.Seq.Base.createEmpty is deprecated, use Seq.empty instead
Spec.Lib.fst(177,18-177,29): (Warning 288) FStar.Seq.Base.createEmpty is deprecated, use Seq.empty instead
Spec.Lib.fst(188,32-188,43): (Warning 288) FStar.Seq.Base.createEmpty is deprecated, use Seq.empty instead
Spec.Lib.fst(198,30-198,41): (Warning 288) FStar.Seq.Base.createEmpty is deprecated, use Seq.empty instead
Spec.Lib.fst(207,32-207,43): (Warning 288) FStar.Seq.Base.createEmpty is deprecated, use Seq.empty instead
Spec.Lib.fst(217,30-217,41): (Warning 288) FStar.Seq.Base.createEmpty is deprecated, use Seq.empty instead
Spec.Lib.fst(226,32-226,43): (Warning 288) FStar.Seq.Base.createEmpty is deprecated, use Seq.empty instead
Spec.Lib.fst(236,30-236,41): (Warning 288) FStar.Seq.Base.createEmpty is deprecated, use Seq.empty instead
Spec.Lib.fst(281,35-281,46): (Warning 288) FStar.Seq.Base.createEmpty is deprecated, use Seq.empty instead
Spec.Lib.fst(330,37-330,48): (Warning 288) FStar.Seq.Base.createEmpty is deprecated, use Seq.empty instead
Spec.Lib.fst(361,65-361,76): (Warning 288) FStar.Seq.Base.createEmpty is deprecated, use Seq.empty instead
Spec.Lib.fst(362,45-362,56): (Warning 288) FStar.Seq.Base.createEmpty is deprecated, use Seq.empty instead
Spec.Lib.fst(387,55-387,66): (Warning 288) FStar.Seq.Base.createEmpty is deprecated, use Seq.empty instead
Spec.Lib.fst(388,43-388,54): (Warning 288) FStar.Seq.Base.createEmpty is deprecated, use Seq.empty instead
make[1]: *** [Makefile:10: all] Error 2
make: *** [Makefile:96: extract-specs] Error 2
make: [Makefile:157: .depend-TLS] Error 1 (ignored)
make: [Makefile:159: .depend-HS] Error 1 (ignored)
make: [Makefile:161: .depend-AEAD] Error 1 (ignored)
make: [Makefile:163: .depend-CDH] Error 1 (ignored)
.depend-CDH:1: *** missing separator. Stop.
Command exited with non-zero status 255
154.42user 223.16system 15:24.38elapsed 40%CPU (0avgtext+0avgdata 1592993792maxresident)k
0inputs+0outputs (8013414major+0minor)pagefaults 0swaps
+ make -C hacl-star test-all package -k
Warning 3: run_or_warn: the following command failed:
C:/build/agent2/_work/6/s/FStar/bin/fstar.exe --odir chacha-c --codegen Kremlin --lax --no_extract FStar.Monotonic.HyperStack --no_extract FStar.Buffer --no_extract FStar.Monotonic.HyperHeap --no_extract FStar.Map --no_extract FStar.Math.Lib --no_extract FStar.HyperHeap --no_extract FStar.HyperStack --no_extract FStar.HyperStack.ST --no_extract FStar.Seq.Base --no_extract FStar.Int128 --no_extract FStar.UInt64 --no_extract FStar.Int64 --no_extract FStar.UInt63 --no_extract FStar.Int63 --no_extract FStar.UInt32 --no_extract FStar.Int32 --no_extract FStar.UInt31 --no_extract FStar.Int31 --no_extract FStar.UInt16 --no_extract FStar.Int16 --no_extract FStar.UInt8 --no_extract FStar.Int8 --trace_error --include C:/build/agent2/_work/6/s/hacl-star/code/lib/kremlin --include C:/build/agent2/_work/6/s/kremlin/kremlib --include C:/build/agent2/_work/6/s/hacl-star/specs --include . --include C:/build/agent2/_work/6/s/kremlin/kremlib Hacl.Lib.LoadStore32.fst Hacl.Lib.Create.fst Hacl.Impl.Xor.Lemmas.fst Hacl.Impl.Chacha20.fst Hacl.Chacha20.fst Hacl.Test.Chacha20.fst
F* failed
Fatal error: exception Warnings.Fatal("Unrecoverable error")
Raised at file "src/Warnings.ml", line 49, characters 4-39
Called from file "src/Driver.ml", line 287, characters 6-29
Called from file "src/Kremlin.ml", line 326, characters 14-96
make[4]: *** [Makefile:48: chacha-c/out.krml] Error 2
Warning 3: run_or_warn: the following command failed:
C:/build/agent2/_work/6/s/FStar/bin/fstar.exe --odir salsa-c --codegen Kremlin --lax --no_extract FStar.Monotonic.HyperStack --no_extract FStar.Buffer --no_extract FStar.Monotonic.HyperHeap --no_extract FStar.Map --no_extract FStar.Math.Lib --no_extract FStar.HyperHeap --no_extract FStar.HyperStack --no_extract FStar.HyperStack.ST --no_extract FStar.Seq.Base --no_extract FStar.Int128 --no_extract FStar.UInt64 --no_extract FStar.Int64 --no_extract FStar.UInt63 --no_extract FStar.Int63 --no_extract FStar.UInt32 --no_extract FStar.Int32 --no_extract FStar.UInt31 --no_extract FStar.Int31 --no_extract FStar.UInt16 --no_extract FStar.Int16 --no_extract FStar.UInt8 --no_extract FStar.Int8 --trace_error --include C:/build/agent2/_work/6/s/hacl-star/code/lib/kremlin --include C:/build/agent2/_work/6/s/kremlin/kremlib --include C:/build/agent2/_work/6/s/hacl-star/specs --include . --include C:/build/agent2/_work/6/s/kremlin/kremlib Hacl.Impl.Salsa20.fst Hacl.Salsa20.fst Hacl.Test.Salsa20.fst
F* failed
Fatal error: exception Warnings.Fatal("Unrecoverable error")
Raised at file "src/Warnings.ml", line 49, characters 4-39
Called from file "src/Driver.ml", line 287, characters 6-29
Called from file "src/Kremlin.ml", line 326, characters 14-96
make[4]: *** [Makefile:66: salsa-c/out.krml] Error 2
Warning 3: run_or_warn: the following command failed:
C:/build/agent2/_work/6/s/FStar/bin/fstar.exe --odir chacha-vec128-c --codegen Kremlin --lax --no_extract FStar.Monotonic.HyperStack --no_extract FStar.Buffer --no_extract FStar.Monotonic.HyperHeap --no_extract FStar.Map --no_extract FStar.Math.Lib --no_extract FStar.HyperHeap --no_extract FStar.HyperStack --no_extract FStar.HyperStack.ST --no_extract FStar.Seq.Base --no_extract FStar.Int128 --no_extract FStar.UInt64 --no_extract FStar.Int64 --no_extract FStar.UInt63 --no_extract FStar.Int63 --no_extract FStar.UInt32 --no_extract FStar.Int32 --no_extract FStar.UInt31 --no_extract FStar.Int31 --no_extract FStar.UInt16 --no_extract FStar.Int16 --no_extract FStar.UInt8 --no_extract FStar.Int8 --trace_error --include C:/build/agent2/_work/6/s/hacl-star/code/lib/kremlin --include C:/build/agent2/_work/6/s/kremlin/kremlib --include C:/build/agent2/_work/6/s/hacl-star/specs --include . --include C:/build/agent2/_work/6/s/kremlin/kremlib Hacl.Impl.Chacha20.Vec128.State.fst Hacl.Impl.Chacha20.Vec128.fst Hacl.Chacha20.Vec128.fst Hacl.Test.Chacha20.Vec128.fst
F* failed
Fatal error: exception Warnings.Fatal("Unrecoverable error")
Raised at file "src/Warnings.ml", line 49, characters 4-39
Called from file "src/Driver.ml", line 287, characters 6-29
Called from file "src/Kremlin.ml", line 326, characters 14-96
make[4]: *** [Makefile:83: chacha-vec128-c/out.krml] Error 2
make[4]: Target 'test' not remade because of errors.
make[3]: *** [Makefile:12: salsa-family-test] Error 2
Warning 3: run_or_warn: the following command failed:
C:/build/agent2/_work/6/s/FStar/bin/fstar.exe --odir poly-c --codegen Kremlin --lax --no_extract FStar.Monotonic.HyperStack --no_extract FStar.Buffer --no_extract FStar.Monotonic.HyperHeap --no_extract FStar.Map --no_extract FStar.Math.Lib --no_extract FStar.HyperHeap --no_extract FStar.HyperStack --no_extract FStar.HyperStack.ST --no_extract FStar.Seq.Base --no_extract FStar.Int128 --no_extract FStar.UInt64 --no_extract FStar.Int64 --no_extract FStar.UInt63 --no_extract FStar.Int63 --no_extract FStar.UInt32 --no_extract FStar.Int32 --no_extract FStar.UInt31 --no_extract FStar.Int31 --no_extract FStar.UInt16 --no_extract FStar.Int16 --no_extract FStar.UInt8 --no_extract FStar.Int8 --trace_error --include C:/build/agent2/_work/6/s/hacl-star/code/lib/kremlin --include C:/build/agent2/_work/6/s/kremlin/kremlib --include C:/build/agent2/_work/6/s/hacl-star/specs --include . --include ../bignum --include C:/build/agent2/_work/6/s/kremlin/kremlib ../bignum/Hacl.Spec.Bignum.Field.fst ../bignum/Hacl.Bignum.Limb.fst ../bignum/Hacl.Bignum.Wide.fst ../bignum/Hacl.Spec.Bignum.Bigint.fst ../bignum/Hacl.Spec.Bignum.Fsum.fst ../bignum/Hacl.Spec.Bignum.Fproduct.fst ../bignum/Hacl.Spec.Bignum.Fmul.fst ../bignum/Hacl.Bignum.Fsum.fst ../bignum/Hacl.Bignum.Fproduct.fst ../bignum/Hacl.Bignum.Fmul.fst Hacl.Bignum.Constants.fst Hacl.Bignum.Parameters.fst Hacl.Spec.Bignum.Modulo.fst Hacl.Spec.Bignum.AddAndMultiply.fst ../../specs/Spec.Poly1305.fst Hacl.Spec.Poly1305_64.fst Hacl.Spe.Poly1305_64.fst Hacl.Bignum.Modulo.fst Hacl.Bignum.AddAndMultiply.fst Hacl.Impl.Poly1305_64.fst Hacl.Standalone.Poly1305_64.fst Hacl.Poly1305_64.fst Hacl.Spec.Poly1305_64.Lemmas1.fst AEAD.Poly1305_64.fst Hacl.Test.Poly1305_64.fst
F* failed
Fatal error: exception Warnings.Fatal("Unrecoverable error")
Raised at file "src/Warnings.ml", line 49, characters 4-39
Called from file "src/Driver.ml", line 287, characters 6-29
Called from file "src/Kremlin.ml", line 326, characters 14-96
make[4]: *** [Makefile:82: poly-c/out.krml] Error 2
make[4]: Target 'test' not remade because of errors.
make[3]: *** [Makefile:12: poly1305-test] Error 2
Warning 3: run_or_warn: the following command failed:
C:/build/agent2/_work/6/s/FStar/bin/fstar.exe --odir poly-c --codegen Kremlin --lax --no_extract FStar.Monotonic.HyperStack --no_extract FStar.Buffer --no_extract FStar.Monotonic.HyperHeap --no_extract FStar.Map --no_extract FStar.Math.Lib --no_extract FStar.HyperHeap --no_extract FStar.HyperStack --no_extract FStar.HyperStack.ST --no_extract FStar.Seq.Base --no_extract FStar.Int128 --no_extract FStar.UInt64 --no_extract FStar.Int64 --no_extract FStar.UInt63 --no_extract FStar.Int63 --no_extract FStar.UInt32 --no_extract FStar.Int32 --no_extract FStar.UInt31 --no_extract FStar.Int31 --no_extract FStar.UInt16 --no_extract FStar.Int16 --no_extract FStar.UInt8 --no_extract FStar.Int8 --trace_error --include C:/build/agent2/_work/6/s/hacl-star/code/lib/kremlin --include C:/build/agent2/_work/6/s/kremlin/kremlib --include C:/build/agent2/_work/6/s/hacl-star/specs --include . --include ../bignum --include C:/build/agent2/_work/6/s/kremlin/kremlib C:/build/agent2/_work/6/s/hacl-star/code/bignum/Hacl.Spec.Bignum.Field.fst C:/build/agent2/_work/6/s/hacl-star/code/bignum/Hacl.Bignum.Limb.fst C:/build/agent2/_work/6/s/hacl-star/code/bignum/Hacl.Bignum.Wide.fst C:/build/agent2/_work/6/s/hacl-star/code/bignum/Hacl.Spec.Bignum.Bigint.fst C:/build/agent2/_work/6/s/hacl-star/code/bignum/Hacl.Spec.Bignum.Fsum.fst C:/build/agent2/_work/6/s/hacl-star/code/bignum/Hacl.Spec.Bignum.Fproduct.fst C:/build/agent2/_work/6/s/hacl-star/code/bignum/Hacl.Spec.Bignum.Fmul.fst C:/build/agent2/_work/6/s/hacl-star/code/bignum/Hacl.Bignum.Fsum.fst C:/build/agent2/_work/6/s/hacl-star/code/bignum/Hacl.Bignum.Fproduct.fst C:/build/agent2/_work/6/s/hacl-star/code/bignum/Hacl.Bignum.Fmul.fst Hacl.Bignum.Constants.fst Hacl.Bignum.Parameters.fst Hacl.Spec.Bignum.Modulo.fst Hacl.Spec.Bignum.AddAndMultiply.fst Hacl.Spec.Poly1305_32.State.fst Hacl.Spec.Poly1305_32.Lemmas.fst Hacl.Spec.Poly1305_32.fst Hacl.Spe.Poly1305_32.fst Hacl.Bignum.Modulo.fst Hacl.Bignum.AddAndMultiply.fst Hacl.Impl.Poly1305_32.State.fst Hacl.Impl.Poly1305_32.fst Hacl.Standalone.Poly1305_32.fst Hacl.Poly1305_32.fst Hacl.Test.Poly1305_32.fst
F* failed
Fatal error: exception Warnings.Fatal("Unrecoverable error")
Raised at file "src/Warnings.ml", line 49, characters 4-39
Called from file "src/Driver.ml", line 287, characters 6-29
Called from file "src/Kremlin.ml", line 326, characters 14-96
make[4]: *** [Makefile:75: poly-c/out.krml] Error 2
make[4]: Target 'test' not remade because of errors.
make[3]: *** [Makefile:12: poly1305_32-test] Error 2
Warning 3: run_or_warn: the following command failed:
C:/build/agent2/_work/6/s/FStar/bin/fstar.exe --odir x25519-c --codegen Kremlin --lax --no_extract FStar.Monotonic.HyperStack --no_extract FStar.Buffer --no_extract FStar.Monotonic.HyperHeap --no_extract FStar.Map --no_extract FStar.Math.Lib --no_extract FStar.HyperHeap --no_extract FStar.HyperStack --no_extract FStar.HyperStack.ST --no_extract FStar.Seq.Base --no_extract FStar.Int128 --no_extract FStar.UInt64 --no_extract FStar.Int64 --no_extract FStar.UInt63 --no_extract FStar.Int63 --no_extract FStar.UInt32 --no_extract FStar.Int32 --no_extract FStar.UInt31 --no_extract FStar.Int31 --no_extract FStar.UInt16 --no_extract FStar.Int16 --no_extract FStar.UInt8 --no_extract FStar.Int8 --trace_error --include C:/build/agent2/_work/6/s/hacl-star/code/lib/kremlin --include C:/build/agent2/_work/6/s/kremlin/kremlib --include C:/build/agent2/_work/6/s/hacl-star/specs --include . --include ../bignum --include C:/build/agent2/_work/6/s/kremlin/kremlib ../bignum/Hacl.Bignum.Fdifference.fst ../bignum/Hacl.Bignum.Fmul.fst ../bignum/Hacl.Bignum.Fproduct.fst ../bignum/Hacl.Bignum.Fscalar.fst ../bignum/Hacl.Bignum.Fsum.fst ../bignum/Hacl.Bignum.Limb.fst ../bignum/Hacl.Bignum.Wide.fst ../bignum/Hacl.Bignum.fst ../bignum/Hacl.Spec.Bignum.Bigint.fst ../bignum/Hacl.Spec.Bignum.Fdifference.fst ../bignum/Hacl.Spec.Bignum.Field.fst ../bignum/Hacl.Spec.Bignum.Fmul.fst ../bignum/Hacl.Spec.Bignum.Fproduct.fst ../bignum/Hacl.Spec.Bignum.Fscalar.fst ../bignum/Hacl.Spec.Bignum.Fsum.fst ../bignum/Hacl.Spec.Bignum.fst Hacl.Spec.Curve25519.Lemmas.fst Hacl.Bignum.Parameters.fst Hacl.Spec.Bignum.Modulo.fst Hacl.Spec.EC.AddAndDouble.fst Hacl.Spec.Bignum.Fsquare.fst Hacl.Spec.Bignum.Crecip.fst Hacl.Bignum.Modulo.fst Hacl.Bignum.Fsquare.fst Hacl.Bignum.Crecip.fst Hacl.Spec.EC.Point.fst Hacl.EC.Point.fst Hacl.Spec.EC.AddAndDouble2.fst Hacl.Spec.EC.AddAndDouble3.fst Hacl.Spec.EC.Format.Lemmas.fst Hacl.Spec.EC.Format.fst Hacl.EC.Format.fst Hacl.EC.AddAndDouble.fst Hacl.Spec.EC.Ladder.Lemmas.fst Hacl.Spec.EC.Ladder.fst Hacl.EC.Ladder.SmallLoop.fst Hacl.EC.Ladder.BigLoop.fst Hacl.EC.Ladder.fst Hacl.Spec.EC.fst Hacl.EC.fst Hacl.Curve25519.fst Hacl.Test.X25519.fst
F* failed
Fatal error: exception Warnings.Fatal("Unrecoverable error")
Raised at file "src/Warnings.ml", line 49, characters 4-39
Called from file "src/Driver.ml", line 287, characters 6-29
Called from file "src/Kremlin.ml", line 326, characters 14-96
make[4]: *** [Makefile:95: x25519-c/out.krml] Error 2
make[4]: Target 'test' not remade because of errors.
make[3]: *** [Makefile:12: curve25519-test] Error 2
Warning 3: run_or_warn: the following command failed:
C:/build/agent2/_work/6/s/FStar/bin/fstar.exe --odir hmac-c --codegen Kremlin --lax --no_extract FStar.Monotonic.HyperStack --no_extract FStar.Buffer --no_extract FStar.Monotonic.HyperHeap --no_extract FStar.Map --no_extract FStar.Math.Lib --no_extract FStar.HyperHeap --no_extract FStar.HyperStack --no_extract FStar.HyperStack.ST --no_extract FStar.Seq.Base --no_extract FStar.Int128 --no_extract FStar.UInt64 --no_extract FStar.Int64 --no_extract FStar.UInt63 --no_extract FStar.Int63 --no_extract FStar.UInt32 --no_extract FStar.Int32 --no_extract FStar.UInt31 --no_extract FStar.Int31 --no_extract FStar.UInt16 --no_extract FStar.Int16 --no_extract FStar.UInt8 --no_extract FStar.Int8 --trace_error --include C:/build/agent2/_work/6/s/hacl-star/code/lib/kremlin --include C:/build/agent2/_work/6/s/kremlin/kremlib --include C:/build/agent2/_work/6/s/hacl-star/specs --include . --include C:/build/agent2/_work/6/s/hacl-star/code/hash --include C:/build/agent2/_work/6/s/kremlin/kremlib Hacl.HMAC.SHA2_256.fst Hacl.Test.HMAC.SHA2_256.fst
F* failed
Fatal error: exception Warnings.Fatal("Unrecoverable error")
Raised at file "src/Warnings.ml", line 49, characters 4-39
Called from file "src/Driver.ml", line 287, characters 6-29
Called from file "src/Kremlin.ml", line 326, characters 14-96
make[4]: *** [Makefile:43: hmac-c/out.krml] Error 2
make[4]: Target 'test' not remade because of errors.
make[3]: *** [Makefile:12: hmac-test] Error 2
Warning 3: run_or_warn: the following command failed:
C:/build/agent2/_work/6/s/FStar/bin/fstar.exe --odir ed25519-c --codegen Kremlin --lax --no_extract FStar.Monotonic.HyperStack --no_extract FStar.Buffer --no_extract FStar.Monotonic.HyperHeap --no_extract FStar.Map --no_extract FStar.Math.Lib --no_extract FStar.HyperHeap --no_extract FStar.HyperStack --no_extract FStar.HyperStack.ST --no_extract FStar.Seq.Base --no_extract FStar.Int128 --no_extract FStar.UInt64 --no_extract FStar.Int64 --no_extract FStar.UInt63 --no_extract FStar.Int63 --no_extract FStar.UInt32 --no_extract FStar.Int32 --no_extract FStar.UInt31 --no_extract FStar.Int31 --no_extract FStar.UInt16 --no_extract FStar.Int16 --no_extract FStar.UInt8 --no_extract FStar.Int8 --trace_error --include C:/build/agent2/_work/6/s/hacl-star/code/lib/kremlin --include C:/build/agent2/_work/6/s/kremlin/kremlib --include C:/build/agent2/_work/6/s/hacl-star/specs --include . --include ../bignum --include ../curve25519 --include ../hash --include C:/build/agent2/_work/6/s/kremlin/kremlib Hacl.Bignum25519.fst ../hash/Hacl.Impl.SHA512.Ed25519.fst ../hash/Hacl.SHA2_512.fst Hacl.Impl.Load56.fst Hacl.Impl.Load51.fst Hacl.Impl.Store51.fst Hacl.Impl.BignumQ.Mul.fst Hacl.Impl.SHA512.ModQ.fst Hacl.Impl.Sha512.fst Hacl.Impl.Ed25519.Pow2_252m2.fst Hacl.Impl.Ed25519.PointAdd.fst Hacl.Impl.Ed25519.PointDouble.fst Hacl.Impl.Ed25519.SecretExpand.fst Hacl.Impl.Ed25519.PointCompress.fst Hacl.Impl.Ed25519.PointDecompress.fst Hacl.Impl.Ed25519.RecoverX.fst Hacl.Impl.Ed25519.Ladder.Step.fst Hacl.Impl.Ed25519.Ladder.fst Hacl.Impl.Ed25519.PointEqual.fst Hacl.Impl.Ed25519.SecretToPublic.fst Hacl.Ed25519.fst Hacl.Test.Ed25519.fst
F* failed
Fatal error: exception Warnings.Fatal("Unrecoverable error")
Raised at file "src/Warnings.ml", line 49, characters 4-39
Called from file "src/Driver.ml", line 287, characters 6-29
Called from file "src/Kremlin.ml", line 326, characters 14-96
make[4]: *** [Makefile:135: ed25519-c/out.krml] Error 2
make[4]: Target 'test' not remade because of errors.
make[3]: *** [Makefile:12: ed25519-test] Error 2
Warning 3: run_or_warn: the following command failed:
C:/build/agent2/_work/6/s/FStar/bin/fstar.exe --odir sha2-c --codegen Kremlin --lax --no_extract FStar.Monotonic.HyperStack --no_extract FStar.Buffer --no_extract FStar.Monotonic.HyperHeap --no_extract FStar.Map --no_extract FStar.Math.Lib --no_extract FStar.HyperHeap --no_extract FStar.HyperStack --no_extract FStar.HyperStack.ST --no_extract FStar.Seq.Base --no_extract FStar.Int128 --no_extract FStar.UInt64 --no_extract FStar.Int64 --no_extract FStar.UInt63 --no_extract FStar.Int63 --no_extract FStar.UInt32 --no_extract FStar.Int32 --no_extract FStar.UInt31 --no_extract FStar.Int31 --no_extract FStar.UInt16 --no_extract FStar.Int16 --no_extract FStar.UInt8 --no_extract FStar.Int8 --trace_error --include C:/build/agent2/_work/6/s/hacl-star/code/lib/kremlin --include C:/build/agent2/_work/6/s/kremlin/kremlib --include C:/build/agent2/_work/6/s/hacl-star/specs --include . --include C:/build/agent2/_work/6/s/kremlin/kremlib Hacl.Hash.Lib.LoadStore.fst Hacl.Hash.Lib.Create.fst Hacl.Impl.SHA2_512.Lemmas.fst Hacl.Impl.SHA2_512.fst Hacl.Impl.SHA2_384.Lemmas.fst Hacl.Impl.SHA2_384.fst Hacl.Impl.SHA2_256.Lemmas.fst Hacl.Impl.SHA2_256.fst Hacl.SHA2_256.fst Hacl.SHA2_384.fst Hacl.SHA2_512.fst Hacl.Test.SHA2_256.fst Hacl.Test.SHA2_384.fst Hacl.Test.SHA2_512.fst
F* failed
Fatal error: exception Warnings.Fatal("Unrecoverable error")
Raised at file "src/Warnings.ml", line 49, characters 4-39
Called from file "src/Driver.ml", line 287, characters 6-29
Called from file "src/Kremlin.ml", line 326, characters 14-96
make[4]: *** [Makefile:43: sha2-c/out.krml] Error 2
make[4]: Target 'test' not remade because of errors.
make[3]: *** [Makefile:12: hash-test] Error 2
Warning 3: run_or_warn: the following command failed:
C:/build/agent2/_work/6/s/FStar/bin/fstar.exe --odir ccomp-c --codegen Kremlin --lax C:/build/agent2/_work/6/s/FStar/ulib/FStar.UInt128.fst --no_extract FStar.Monotonic.HyperStack --no_extract FStar.Buffer --no_extract FStar.Monotonic.HyperHeap --no_extract FStar.Map --no_extract FStar.Math.Lib --no_extract FStar.HyperHeap --no_extract FStar.HyperStack --no_extract FStar.HyperStack.ST --no_extract FStar.Seq.Base --no_extract FStar.Int128 --no_extract FStar.UInt64 --no_extract FStar.Int64 --no_extract FStar.UInt63 --no_extract FStar.Int63 --no_extract FStar.UInt32 --no_extract FStar.Int32 --no_extract FStar.UInt31 --no_extract FStar.Int31 --no_extract FStar.UInt16 --no_extract FStar.Int16 --no_extract FStar.UInt8 --no_extract FStar.Int8 --trace_error --include C:/build/agent2/_work/6/s/kremlin/kremlib C:/build/agent2/_work/6/s/FStar/ulib/FStar.UInt128.fst C:/build/agent2/_work/6/s/FStar/ulib/FStar.Int.Cast.Full.fst Hacl.UInt128.fst Hacl.Cast.fst
F* failed
Fatal error: exception Warnings.Fatal("Unrecoverable error")
Raised at file "src/Warnings.ml", line 49, characters 4-39
Called from file "src/Driver.ml", line 287, characters 6-29
Called from file "src/Kremlin.ml", line 326, characters 14-96
make[4]: *** [Makefile:38: ccomp-c/FStar.h] Error 2
Warning 3: run_or_warn: the following command failed:
C:/build/agent2/_work/6/s/FStar/bin/fstar.exe --odir lib-c --codegen Kremlin --lax --no_extract FStar.Monotonic.HyperStack --no_extract FStar.Buffer --no_extract FStar.Monotonic.HyperHeap --no_extract FStar.Map --no_extract FStar.Math.Lib --no_extract FStar.HyperHeap --no_extract FStar.HyperStack --no_extract FStar.HyperStack.ST --no_extract FStar.Seq.Base --no_extract FStar.Int128 --no_extract FStar.UInt64 --no_extract FStar.Int64 --no_extract FStar.UInt63 --no_extract FStar.Int63 --no_extract FStar.UInt32 --no_extract FStar.Int32 --no_extract FStar.UInt31 --no_extract FStar.Int31 --no_extract FStar.UInt16 --no_extract FStar.Int16 --no_extract FStar.UInt8 --no_extract FStar.Int8 --trace_error --include C:/build/agent2/_work/6/s/kremlin/kremlib Hacl.Policies.fst
F* failed
Fatal error: exception Warnings.Fatal("Unrecoverable error")
Raised at file "src/Warnings.ml", line 49, characters 4-39
Called from file "src/Driver.ml", line 287, characters 6-29
Called from file "src/Kremlin.ml", line 326, characters 14-96
make[4]: *** [Makefile:32: lib-c/Hacl_Policies.c] Error 2
make[4]: Target 'test' not remade because of errors.
make[3]: *** [Makefile:12: lib/kremlin-test] Error 2
make[3]: Target 'test' not remade because of errors.
make[2]: *** [Makefile:68: test-code] Error 2
make[1]: *** [Makefile:37: all] Error 2
make: *** [Makefile:135: test-all] Error 2
Command exited with non-zero status 2
0.63user 2.18system 0:24.59elapsed 11%CPU (0avgtext+0avgdata 68985856maxresident)k
0inputs+0outputs (280948major+0minor)pagefaults 0swaps
.depend-CDH:1: *** missing separator. Stop.
Command exited with non-zero status 2
0.03user 0.28system 0:00.39elapsed 80%CPU (0avgtext+0avgdata 12461312maxresident)k
0inputs+0outputs (50657major+0minor)pagefaults 0swaps